{"text_format":"1","workbook":"xlsx","n_sheets":20,"sheets":["Data","Mandals3","Mandals2","Rec. Hos","Code","MAIN","Rs","Employee Letter","DDO Letter","Mandals1","Form c","Check Slip","Salary","aPP ii","PROFORMA","Dependent","Avilment","Nondrawl.","Undertaking Cer","Medical Attendence Rules"],"not_rendered":{"charts":0,"images":4,"macros":1,"external_links":1,"defined_names":13,"comments":1,"pivot_tables":0},"unopened":[],"bounds":{"document_bytes":16777216,"sheet_cells":100000,"rows_first":2000,"rows_last":500,"rows_between":2000,"halvings":0,"cell_chars":16384,"cell_head_chars":4096},"cells_cut":0,"cells_raw":0,"read":"whole","date_system":"1900"}

{"sheet":"Data","index":0,"n_rows":305,"n_cols":101,"rows_kept":305,"cut":false,"hidden":true,"merged":[[6,1,8,1],[4,1,4,8],[6,10,11,11],[12,10,14,12],[10,1,18,1]]}
[]
[null,null,null,null,null,null,null,null,null,null,null,null,null,null,null,1,"Son"]
[null,null,null,null,null,null,null,null,null,null,null,null,null,null,null,2,"Daughter"]
[null,null,null,null,null,null,null,null,null,null,null,null,null,null,null,3,"Wife"]
[null,"Data"]
[]
[null,"Service certificate","Name",1,{"$f":"MAIN!I6","v":"G.Saivijaya Kumar"},"S/O,W/O,D/O",1,1,null,null,null,null,null,null,null,1,"Sri."]
[null,null,"Designation",null,"SA(English)","Designation",null,null,null,null,null,null,null,null,null,2,"Smt."]
[null,null,"Working place",null,"ZPPHS,Balayapalli","Working place",null,null,null,null,null,null,null,null,null,3,"Kum."]
[]
[null,"Salary certificate","Salary Details",null,null,"Deductions"]
[null,null,"Basic Pay",null,15280,"GPF/ZPPF/CPS",null,null,1500,null,null,null,null,null,null,{"$f":"VLOOKUP(D7,P7:Q9,2,FALSE)","v":"Sri."},{"$f":"VLOOKUP(H7,P7:Q9,2,FALSE)","v":"Sri."}]
[null,null,"DA",null,1439,"GPF/ZPPF/CPS LOAN",null,null,null,null,"G.BHASKER REDDY\n9666570250",null,null,null,null,{"$f":"VLOOKUP(G7,P2:Q4,2,FALSE)","v":"Son"}]
[null,null,"FPI",null,null,"FestivalAdvance",null,null,200]
[null,null,"AI",null,null,"GIS",null,null,60]
[null,null,"Others",null,null,"APGLI",null,null,250]
[null,null,null,null,null,"LIC",null,null,845]
[null,null,null,null,null,"Others"]
[]
[]
[null,"Non drawl","Amount"]
[]
[]
[]
[]
[]
[]
[]
[]
[]
[]
[]
[]
[]
[]
[]
[]
[]
[]
[]
[]
[]
[]
[]
[]
[]
[]
[]
[]
[]
[]
[]
[]
[]
[]
[]
[]
[]
[]
[]
[]
[]
[]
[]
[]
[]
[]
[]
[]
[]
[]
[]
[]
[]
[]
[]
[]
[]
[]
[]
[]
[]
[]
[]
[]
[]
[]
[]
[]
[]
[]
[]
[]
[]
[]
[]
[]
[]
[]
[]
[]
[]
[]
[]
[]
[]
[]
[]
[]
[]
[]
[]
[]
[]
[]
[]
[]
[]
[]
[]
[]
[]
[]
[]
[]
[]
[]
[]
[]
[]
[]
[]
[]
[]
[]
[]
[]
[]
[]
[]
[]
[]
[]
[]
[]
[]
[]
[]
[]
[]
[]
[]
[]
[]
[]
[]
[]
[]
[]
[]
[]
[]
[]
[]
[]
[]
[]
[]
[]
[]
[]
[]
[]
[]
[]
[]
[]
[]
[]
[]
[]
[]
[]
[]
[]
[]
[]
[]
[]
[]
[]
[]
[]
[]
[]
[]
[]
[]
[]
[]
[]
[]
[]
[]
[]
[]
[]
[]
[]
[]
[]
[]
[]
[]
[]
[]
[]
[]
[]
[]
[]
[]
[]
[]
[]
[]
[]
[]
[]
[]
[]
[]
[]
[]
[]
[]
[]
[]
[]
[]
[]
[]
[]
[]
[]
[]
[]
[]
[]
[]
[]
[]
[]
[]
[]
[]
[]
[]
[]
[]
[]
[]
[]
[]
[]
[]
[]
[]
[]
[]
[]
[]
[]
[]
[]
[]
[]
[]
[]
[]
[]
[]
[]
[]
[]
[]
[null,1,2,3,4,5,6,7,null,null,null,8,9,10,11,12,13,14,15,16,17,18,19,20,21,22,23,24,25,26,27,30,31,32,33,34,35,36,37,38,39,40,41,42,43,44,45,46,47,48,49,50,51,52,53,54,55,56,57,58,59,60,61,62,63,64,65,66,67,68,69,70,71,72,73,74,75,76,77,78,79,80,81,82,83,84,85,86,87,88,89,90,91,92,93,94,95,96,97,98,99]
[null,"One","Two","Three","Four","Five","Six","Seven",null,null,null,"Eight","Nine","Ten","Eleven","Twelve","Thirteen","Fourteen","Fifteen","Sixteen","Seventeen","Eighteen","Nineteen","Twenty","Twenty one","Twenty two","Twenty three","Twenty four","Twenty five","Twenty six","Twenty seven","Thirty ","Thirty one","Thirty two","Thirty three","Thirty four","Thirty five","Thirty six","Thirty seven","Thirty eight","Thirty nine","Forty ","Forty one","Forty two","Forty three","Forty four","Forty five","Forty six","Forty seven","Forty eight","Forty nine","Fifty","Fifty one","Fifty two","Fifty three","Fifty four","Fifty five","Fifty six","Fifty seven","Fifty eight","Fifty nine","sixty","Sixty one","Sixty two","Sixty three","Sixty four","Sixty five","Sixty six","Sixty seven","Sixty eight","Sixty nine","Seventy","Seventy one","Seventy two","Seventy three","Seventy four","Seventy five","Seventy six","Seventy seven","Seventy eight","Seventy nine","Eighty ","Eighty one","Eighty two","Eighty three","Eighty four","Eighty five","Eighty six","Eighty seven","Eighty eight","Eighty nine","Ninety","Ninety one","Ninety two","Ninety three","Ninety four","Ninety five","Ninety six","Ninety seven","Ninety eight","Ninety nine"]
[]
[{"$f":"[1]Salary!$D$25","v":12287},{"$f":"IF(A290=\"\",\"\",CONCATENATE(Q290,\" rupees only\"))","v":"Twelve Thousand Two Hundred and Eighty seven rupees only"},{"$f":"INT(A290/100000)","v":0},{"$f":"INT(A290/1000-C290*100)","v":12},{"$f":"INT(A290/100-C290*1000-D290*10)","v":2},{"$f":"INT(A290-C290*100000-D290*1000-E290*100)","v":87},{"$f":"IF(C290=0,\"\",LOOKUP(C290,B287:CX287,B288:CX288))","v":""},{"$f":"IF(D290=0,\"\",LOOKUP(D290,B287:CX287,B288:CX288))","v":"Twelve"},{"$f":"IF(E290=0,\"\",LOOKUP(E290,B287:CX287,B288:CX288))","v":"Two"},{"$f":"IF(F290=0,\"\",LOOKUP(F290,B287:CX287,B288:CX288))","v":"Eighty seven"},{"$f":"IF(AND(E290=0,F290=0),1,2)","v":2},{"$f":"IF(F290=0,3,4)","v":4},{"$f":"IF(OR(K290=1,L290=3),5,6)","v":6},{"$f":"IF(C290>1,\" Lakhs \",IF(C290>0,\" Lakh \",\"\"))","v":""},{"$f":"IF(D290>0,\" Thousand \",\"\")","v":" Thousand "},{"$f":"IF(E290>0,\" Hundred \",\"\")","v":" Hundred "},{"$f":"IF(A290=0,\"Zero\",IF(A290>0,TRIM(CONCATENATE(G290,N290,H290,O290,I290,P290,IF(AND(A290>100,M290=6),\" and \",\"\"),J290)),\"\"))","v":"Twelve Thousand Two Hundred and Eighty seven"}]
[0,"Zero rupees only",0,0,0,0,{"$f":"IF(C291=0,\"\",LOOKUP(C291,B287:CX287,B288:CX288))","v":""},{"$f":"IF(D291=0,\"\",LOOKUP(D291,B287:CX287,B288:CX288))","v":""},{"$f":"IF(E291=0,\"\",LOOKUP(E291,B287:CX287,B288:CX288))","v":""},{"$f":"IF(F291=0,\"\",LOOKUP(F291,B287:CX287,B288:CX288))","v":""},1,3,5,"","","","Zero"]
[0,"Zero rupees only",0,0,0,0,{"$f":"IF(C292=0,\"\",LOOKUP(C292,B287:CX287,B288:CX288))","v":""},{"$f":"IF(D292=0,\"\",LOOKUP(D292,B287:CX287,B288:CX288))","v":""},{"$f":"IF(E292=0,\"\",LOOKUP(E292,B287:CX287,B288:CX288))","v":""},{"$f":"IF(F292=0,\"\",LOOKUP(F292,B287:CX287,B288:CX288))","v":""},1,3,5,"","","","Zero"]
[0,"Zero rupees only",0,0,0,0,{"$f":"IF(C293=0,\"\",LOOKUP(C293,B287:CX287,B288:CX288))","v":""},{"$f":"IF(D293=0,\"\",LOOKUP(D293,B287:CX287,B288:CX288))","v":""},{"$f":"IF(E293=0,\"\",LOOKUP(E293,B287:CX287,B288:CX288))","v":""},{"$f":"IF(F293=0,\"\",LOOKUP(F293,B287:CX287,B288:CX288))","v":""},1,3,5,"","","","Zero"]
[0,"Zero rupees only",0,0,0,0,{"$f":"IF(C294=0,\"\",LOOKUP(C294,B287:CX287,B288:CX288))","v":""},{"$f":"IF(D294=0,\"\",LOOKUP(D294,B287:CX287,B288:CX288))","v":""},{"$f":"IF(E294=0,\"\",LOOKUP(E294,B287:CX287,B288:CX288))","v":""},{"$f":"IF(F294=0,\"\",LOOKUP(F294,B287:CX287,B288:CX288))","v":""},1,3,5,"","","","Zero"]
[0,"Zero rupees only",0,0,0,0,{"$f":"IF(C295=0,\"\",LOOKUP(C295,B287:CX287,B288:CX288))","v":""},{"$f":"IF(D295=0,\"\",LOOKUP(D295,B287:CX287,B288:CX288))","v":""},{"$f":"IF(E295=0,\"\",LOOKUP(E295,B287:CX287,B288:CX288))","v":""},{"$f":"IF(F295=0,\"\",LOOKUP(F295,B287:CX287,B288:CX288))","v":""},1,3,5,"","","","Zero"]
[0,"Zero rupees only",0,0,0,0,{"$f":"IF(C296=0,\"\",LOOKUP(C296,B287:CX287,B288:CX288))","v":""},{"$f":"IF(D296=0,\"\",LOOKUP(D296,B287:CX287,B288:CX288))","v":""},{"$f":"IF(E296=0,\"\",LOOKUP(E296,B287:CX287,B288:CX288))","v":""},{"$f":"IF(F296=0,\"\",LOOKUP(F296,B287:CX287,B288:CX288))","v":""},1,3,5,"","","","Zero"]
[0,"Zero rupees only",0,0,0,0,{"$f":"IF(C297=0,\"\",LOOKUP(C297,B287:CX287,B288:CX288))","v":""},{"$f":"IF(D297=0,\"\",LOOKUP(D297,B287:CX287,B288:CX288))","v":""},{"$f":"IF(E297=0,\"\",LOOKUP(E297,B287:CX287,B288:CX288))","v":""},{"$f":"IF(F297=0,\"\",LOOKUP(F297,B287:CX287,B288:CX288))","v":""},1,3,5,"","","","Zero"]
[0,"Zero rupees only",0,0,0,0,{"$f":"IF(C298=0,\"\",LOOKUP(C298,B287:CX287,B288:CX288))","v":""},{"$f":"IF(D298=0,\"\",LOOKUP(D298,B287:CX287,B288:CX288))","v":""},{"$f":"IF(E298=0,\"\",LOOKUP(E298,B287:CX287,B288:CX288))","v":""},{"$f":"IF(F298=0,\"\",LOOKUP(F298,B287:CX287,B288:CX288))","v":""},1,3,5,"","","","Zero"]
[0,"Zero rupees only",0,0,0,0,{"$f":"IF(C299=0,\"\",LOOKUP(C299,B287:CX287,B288:CX288))","v":""},{"$f":"IF(D299=0,\"\",LOOKUP(D299,B287:CX287,B288:CX288))","v":""},{"$f":"IF(E299=0,\"\",LOOKUP(E299,B287:CX287,B288:CX288))","v":""},{"$f":"IF(F299=0,\"\",LOOKUP(F299,B287:CX287,B288:CX288))","v":""},1,3,5,"","","","Zero"]
[0,"Zero rupees only",0,0,0,0,{"$f":"IF(C300=0,\"\",LOOKUP(C300,B287:CX287,B288:CX288))","v":""},{"$f":"IF(D300=0,\"\",LOOKUP(D300,B287:CX287,B288:CX288))","v":""},{"$f":"IF(E300=0,\"\",LOOKUP(E300,B287:CX287,B288:CX288))","v":""},{"$f":"IF(F300=0,\"\",LOOKUP(F300,B287:CX287,B288:CX288))","v":""},1,3,5,"","","","Zero"]
[0,"Zero rupees only",0,0,0,0,{"$f":"IF(C301=0,\"\",LOOKUP(C301,B287:CX287,B288:CX288))","v":""},{"$f":"IF(D301=0,\"\",LOOKUP(D301,B287:CX287,B288:CX288))","v":""},{"$f":"IF(E301=0,\"\",LOOKUP(E301,B287:CX287,B288:CX288))","v":""},{"$f":"IF(F301=0,\"\",LOOKUP(F301,B287:CX287,B288:CX288))","v":""},1,3,5,"","","","Zero"]
[0,"Zero rupees only",0,0,0,0,{"$f":"IF(C302=0,\"\",LOOKUP(C302,B287:CX287,B288:CX288))","v":""},{"$f":"IF(D302=0,\"\",LOOKUP(D302,B287:CX287,B288:CX288))","v":""},{"$f":"IF(E302=0,\"\",LOOKUP(E302,B287:CX287,B288:CX288))","v":""},{"$f":"IF(F302=0,\"\",LOOKUP(F302,B287:CX287,B288:CX288))","v":""},1,3,5,"","","","Zero"]
[0,"Zero rupees only",0,0,0,0,{"$f":"IF(C303=0,\"\",LOOKUP(C303,B287:CX287,B288:CX288))","v":""},{"$f":"IF(D303=0,\"\",LOOKUP(D303,B287:CX287,B288:CX288))","v":""},{"$f":"IF(E303=0,\"\",LOOKUP(E303,B287:CX287,B288:CX288))","v":""},{"$f":"IF(F303=0,\"\",LOOKUP(F303,B287:CX287,B288:CX288))","v":""},1,3,5,"","","","Zero"]
[0,"Zero rupees only",0,0,0,0,{"$f":"IF(C304=0,\"\",LOOKUP(C304,B287:CX287,B288:CX288))","v":""},{"$f":"IF(D304=0,\"\",LOOKUP(D304,B287:CX287,B288:CX288))","v":""},{"$f":"IF(E304=0,\"\",LOOKUP(E304,B287:CX287,B288:CX288))","v":""},{"$f":"IF(F304=0,\"\",LOOKUP(F304,B287:CX287,B288:CX288))","v":""},1,3,5,"","","","Zero"]
[0,"Zero rupees only",0,0,0,0,{"$f":"IF(C305=0,\"\",LOOKUP(C305,B287:CX287,B288:CX288))","v":""},{"$f":"IF(D305=0,\"\",LOOKUP(D305,B287:CX287,B288:CX288))","v":""},{"$f":"IF(E305=0,\"\",LOOKUP(E305,B287:CX287,B288:CX288))","v":""},{"$f":"IF(F305=0,\"\",LOOKUP(F305,B287:CX287,B288:CX288))","v":""},1,3,5,"","","","Zero"]

{"sheet":"Mandals3","index":1,"n_rows":119,"n_cols":33,"rows_kept":119,"cut":false,"hidden":true,"merged":[]}
[null,null,null,null,null,null,null,null,null,null,null,null,null,null,null,null,null,null,null,null,null,null,null,null,10,{"$f":"LOOKUP(Y1,Y3:Z25,Z3:Z25)","v":"Krishan District "},5,null,null,null,null,10,{"$f":"LOOKUP(AF1,AF3:AG25,AG3:AG25)","v":"Krishan District "}]
[null,"Adilabad ","Anathapuram","Chittoor District","West godavari District ","Guntur District","Hyderabad   District ","kaddapah District","Kareemnagar District ","Khammam District ","Krishan District ","Kurnool District","Mahaboobnagar District ","Medak District ","Nalgonda District ","Nizamabad District ","Nellore District","Prakasam District","Ranga reddy District ","Sreekakulam District ","Visakhapatnam District","Vizianagaram District","Warangal District ","West godavari  District ","S.No","Districts",{"$f":"LOOKUP(AA1,Y3:Y68,AA3:AA68)","v":"Bapulapadu"},null,11,{"$f":"LOOKUP(AC2,Y3:AA68,AA3:AA68)","v":"Gannavaram"},null,"S.No","Districts"]
[1,"Adilabad ","Agali ","B Kothakota","Achanta","Achampeta",null,"Atlur ","Bheemadevarpalle","Aswapuram ","A Konduru ","Adoni  ","Achampeta","Alladurg","Alair ","Armur ","Allur","Addanki","Balanagar ","Amadalavalasa ","Anakapalli","Badangi","Atmakur  ","Achanta",1,"Adilabad ",{"$f":" HLOOKUP($Z$1,$B$2:$X$68,AB3,FALSE)","v":"A Konduru "},2,null,null,null,1,"Adilabad "]
[2,"Narnoor","Amadagur","Baireddi Palle","Akiveedu","Amaravathi ",null,"B Kodur ","Boinpalle","Aswaraopeta","Agiripalle","Allagadda","Addakal","Andole","Anumula","Balkonda","Ananthasagaram","Ardhaveedu","Bantaram","Battili","Anandapuram ","Balajipeta","Bachannapeta","Akiveedu",2,"Anathapuram","Agiripalle",3,null,null,null,2,"Anathapuram"]
[3,"Bela","Amarapuram","Bangarupalem","Attili","Amruthalur ",null,"Badvel ","Chandurthi","Bayyaram","Avanigadda","Alur","Aiza ","Chegunta","Atmakur ","Banswada","Anumasamudrampeta","Ballikuruva ","Basheerabad","Bhamini","Ananthagiri","Bhoghapuram","Bhupalpalle","Attili",3,"Chittoor District","Avanigadda",4,null,null,null,3,"Chittoor District"]
[4,"Boath","Anantapur","Buchinaidu Khandriga","Bheemavaram","Bapatla ",null,"Brahmamgarimattam ","Choppadandi","Bhadrachalam ","Bantumilli","Aspari","Alampur","Chinna Kodur","Atmakur","Bheemgal","Atmakur","Bestavaripeta ","Chevella","Burja","Araku Valley","Bobbili","Chennaraopet","Bheemavaram",4,"West godavari District ","Bantumilli",5,null,null,null,4,"West godavari District "]
[5,"Dilawarpur","Atmakur","Chandragiri","Bhimadole","Bellamkonda",null,"Chakrayapet","Dharmapuri","Bonakal ","Bapulapadu","Atmakur","Amangal","Doultabad","Bhuvanagiri","Bhiknur","Balayapalli","Chadrasekara Puram  ","Dharur","Etcherla","Atchutapuram ","Bondapalle","Cheriyal","Bhimadole",5,"Guntur District","Bapulapadu",6,null,null,null,5,"Guntur District"]
[6,"Jainad","Bathalapalle","Chinnagottigallu","Buttayagudem","Bhattiprolu ",null,"Chapad ","Dharmaram","Burgampadu","Challapalli ","Banaganapalle","Amrabad","Dubbak","Bibinagar","Bichkunda","Bogole","Chimakurthi ","Domah","Ganguvari Singadam","Bheemunipatnam","Chintalavalasa","Chityal","Buttayagudem",6,"Hyderabad District ","Challapalli ",7,null,null,null,6,"Hyderabad District "]
[7,"Kaddampeddur","Beluguppa","Chittoor","Chagallu","Bollapalle ",null,"Chennur","Ellanthakunta","Chandrugonda","Chandarlapadu","Bandi Atmakur","Atmakur","Eddumailaram","Bommalaramaram","Birkoor ","Buchireddipalem","Chinaganjam ","Gandeed","Kaligapatnam","Butchayyapeta ","Cheepurupalle","Devaruppula","Chagallu",7,"Kaddapah District","Chandarlapadu",8,null,null,null,7,"Kaddapah District"]
[8,"Khanpur","Bommanahal","Chowdepalle","Chintalapudi","Chebrole ",null,"ChinnaChowk ","Gambhiraopet","Cherla","Chatrai","Bethamcherla","Balanagar","Gajwel","Chandam Pet","Bodhan","Chejerla ","Chirala ","Ghatkesar","Hiramandalam","Cheedikada","Dattirajeru","Dharmasagar","Chintalapudi",8,"Kareemnagar District ","Chatrai",9,null,null,null,8,"Kareemnagar District "]
[9,"Kuntala","Brahmasamudram ","Gangadhara Nellore","Denduluru","Cherukupalle ",null,"Chinnamandem ","Gangadhara","Chinthakani","G Konduru","Bugganipalle","Balmoor","Hathnoora","Chandur","Dhar Palle","Chillakur ","Cumbum ","Hayathnagar","Ichchapuram","Chintapalle","Denkada","Dornakal","Denduluru",9,"Khammam District ","G Konduru",10,null,null,null,9,"Khammam District "]
[10,"Mamda","Bukkapatnam","Gangavaram  ","Devarapalle","Chilakaluripet ",null,"Chintha Kommadinne ","Gollapalle","Chintur","Gampalagudem","C.Belagal","Bhoothpur ","Jagdevpur","Chilkur","Dich Palle","Chittamur ","Darsi ","Ibrahimpatam","Jalumuru","Chodavaram","Gajapathinagaram","Duggondi","Devarapalle",10,"Krishan District ","Gampalagudem",11,null,null,null,10,"Krishan District "]
[11,"Rebbana","Bukkarayasamudram","Gudi Palle  ","Dwaraka Tirumala","Dachepalle ",null,"Chitvel ","Husnabad","Dammapeta","Gannavaram","Chagalamarri","Bijinapalle","Jharasangam","Chintha Palle","Domakonda","Dagadarthi ","Donakonda","Kandukur","Kanchili","Devarapalle","Gantyada","Eturnagaram ","Dwaraka Tirumala",11,"Kurnool District","Gannavaram",12,null,null,null,11,"Kurnool District"]
[12,"Talamadugu","Chenne Kothapalle","Gudipala ","Eluru","Duggirala ",null,"Cuddapah ","Huzurabad","Dummugudem","Ghantasala","Chippagiri","Bomraspeta","Jinnaram","Chityala","Gandhari","Dakkili","Dornala ","Keesara","Kaviti","Dumbriguda","Garividi","Geesugonda","Eluru",12,"Mahaboobnagar District ","Ghantasala",13,null,null,null,12,"Mahaboobnagar District "]
[13,"Tiryani","Chilamathur","Gurramkonda  ","Ganapavaram","Durgi ",null,"Duvvur  ","Ibrahimpatnam","Enkuru","Gudivada","Devanakonda","Chinna Chinta Kunta","Kalher","Chivvemla","Jakranpalle","Doravarisatram","Giddaluru ","Kulkacharla","Kotabommili","Gajuwaka","Garugubilli","Ghanapur","Ganapavaram",13,"Medak District ","Gudivada",14,null,null,null,13,"Medak District "]
[14,"Asifabad","D.Hirchal","Irala ","Gopalapuram","Edlapadu",null,"Galiveedu ","Jagtial","Garla","Gudlavalleru","Dhone","Damaragidda","Kohir","Choutuppal","Jukkal","Duttalur ","Gudluru ","Maheswaram","Kothuru ","Gangaraju Madugula","Gummalakshmipuram","Ghanpur(Stn)","Gopalapuram",14,"Nalgonda District ","Gudlavalleru",15,null,null,null,14,"Nalgonda District "]
[15,"Bellampalle","Dharmavaram","K V P Puram ","Iragavaram","Guntur ",null,"Gopavaram","Jammikunta","Gundala","Gudur","Dornipadu","Devarkadara","Kondapak","Dameracherla","Kamareddy","Gudur ","Hanumanthunipadu ","Malkajgiri","Laveru","Golugonda","Gurla","Govindaraopet","Iragavaram",15,"Nizamabad District ","Gudur",16,null,null,null,15,"Nizamabad District "]
[16,"Chennur","Gandlapenta","Kalakada  ","Jangareddigudem","Gurazala ",null,"Jammalamadugu • ","Julapalle","Julurpad","Ibrahimpatnam","Gadivemula","Dhanwada","Kondapur","Devarakonda","Kammar Palle","Indukurpet ","Inkollu ","Manchal ","Mandasa ","Gudem Kothaveedhi","Jami","Gudur","Jangareddigudem",16,"Nellore District","Ibrahimpatnam",17,null,null,null,16,"Nellore District"]
[17,"Gudihathnur","Garladinne","Kalikiri  ","Jeelugumilli","Ipuru",null,"Kalasapadu ","Kamalapur","Kalluru ","Jaggayyapeta","Gonegandla","Dharur","Kowdipalle","Garide Palle","Kotgiri","Jaladanki ","Janakavaram Panguluru ","Marpalle","Meilaputti","Hukumpeta ","Jiyyamma Valasa","Hanamkonda","Jeelugumilli",17,"Prakasam District","Jaggayyapeta",18,null,null,null,17,"Prakasam District"]
[18,"Jainoor","Gooty","Kambhamvaripalle ","Kalla ","Kakumanu",null,"Kamalapuram  ","Kamanpur","Karepalli","Kaikalur","Gospadu","Doulatabad","Kulcharam","Gundala","Lingampet","Kaligiri ","Kandukur ","Medchal ","Nandigam","K Kotapadu","Komarada","Hasanparthy","Kalla ",18,"Ranga reddy District ","Kaikalur",19,null,null,null,18,"Ranga reddy District "]
[19,"Kagaz Nagar","Gorantla","Karvetinagar ","Kamavarapukota","Karempudi",null,"Khajipet ","Karimnagar","Khammam Rural","Kalidindi ","Gudur ","Farooqnagar","Manoor","Gundla Palle","Machareddy","Kaluvoya ","Kanigiri ","Moinabad","Narasannapeta","Kasimkota","Kothavalasa","Jangaon","Kamavarapukota",19,"Sreekakulam District ","Kalidindi ",20,null,null,null,19,"Sreekakulam District "]
[20,"Kotapalle","Gudibanda","Kuppam  ","Kovvur","Karlapalem",null,"Kodur  ","Kataram","Khammam Urban","Kanchika Cherla","Halaharvi","Gadwal","Medak ","Gurrampode","Madnur","Kavali ","Karamchedu ","Mominpet","Palakonda","Kotauratla","Kurupam","Kesamudram","Kovvur",20,"Visakhapatnam District","Kanchika Cherla",21,null,null,null,20,"Visakhapatnam District"]
[21,"Laxmanchanda","Gummagatta","Kurabalakota  ","Koyyalagudem","Kollipara ",null,"Kondapuram  ","Kathlapur","Konijerla ","Kankipadu","Holagunda","Ghanpur","Mirdoddi","Huzurnagar","Makloor","Kodavalur ","Komarolu ","Nawabpet","Palasa","Koyyuru","Lakkavarapukota","Khanapur","Koyyalagudem",21,"Vizianagaram District","Kankipadu",22,null,null,null,21,"Vizianagaram District"]
[22,"Mancherial","Guntakal ","Mandanpalle  ","Lingapalem","Kollur ",null,"Lakkireddipalle • ","Kesavapatnam","Kothagudem","Koduru ","Jupadu Bungalow","Ghattu","Mulug","Jaji Reddi Gudem","Mortad","Kondapuram","Konakanamitla","Pargi","Pathapatnam","Madugula","Makkuva","Kodakandla","Lingapalem",22,"Warangal District ","Koduru ",23,null,null,null,22,"Warangal District "]
[23,"Nennal","Hindupur ","Mulakalacheruvu ","Mogalthur","Krosuru ",null,"Lingala ","Kodimial ","Kukunoor ","Kruthivennu ","Kallur","Gopalpeta","Munpalle"," Kangal","Naga Reddipet","Kota","Kondapi","Peddemul","Polaki","Makavarapalem","Mentada ","Kothagudem ","Mogalthur",23,"West godavari District ","Kruthivennu ",24,null,null,null,23,"West godavari District "]
[24," Sarangapur","Kadiri ","Nagalapuram  ","Nallajerla","Machavaram ",null,"Muddanur  ","Koheda","Kunavaram","Machilipatnam","Kodumur","Hanwada","Nanganur","Kattangoor","Nandipet ","Kovur","Korisapadu ","Pudur","Ponduru","Munagapaka","Merakamudidam","Kuravi ","Nallajerla",24,null,"Machilipatnam",25]
[25,"Tamsi","Kalyandurg","Nagari  ","Narasapuram","Macherla ",null,"Mylavaram ","Konaraopeta","Kusumanchi","Mandavalli","Koilkuntla","Itikyal ","Narayankhed","Kethepalle","Navipet ","Manubolu","Kothapatnam","Quthbullapur","Rajam","Munchingiputtu ","Nellimarla","Lingala Ghanpur","Narasapuram",25,null,"Mandavalli",26]
[26,"Utnur","Kambadur","Narayanavanam  ","Nidadavole","Mangalagiri",null,"Mydukur  ","Koratla","Madhira","Mopidevi","Kolimigundla ","Jadcherla","Narsapur","Kodad ","Nizam Sagar","Marripadu","Kurichedu ","Rajendranagar ","Ranastalam","Nakkapalli","Pachipenta","Maddur","Nidadavole",26,null,"Mopidevi",27]
[27,"Bazarhathnoor","Kanaganapalle","Nimmanapalle  ","Nidamarru","Medikonduru ",null,"Nandalur  ","Mahadevpur","Manuguru ","Movva","Kosigi ","Kalwakurthy","Nyalkal","M Turkapalle","Nizamabad","Muthukur","Lingasamudram ","Saroornagar"," Regidiamadalavalasa ","Narsipatnam","Parvathipuram","Mahabubabad","Nidamarru",27,null,"Movva",28]
[28,"Bhainsa","Kanekal","Nindra  ","Palacole","Muppalla",null,"Obulavaripalle  ","Malharrao","Mudigonda","Mudinepalli","Kothapalle","Keshampeta ","Papannapet","Marri Guda ","Pitlam","Naidupeta","Maddipadu ","Serilingampalle","Santhabommali ","Nathavaram","Pusapatirega","Mangapet","Palacole",28,null,"Mudinepalli",29]
[29,"Dahegaon","Kothacheruvu","Pakala  ","Palakoderu","Nadendla ",null,"Peddamudium • ","Mallapur","Mulakalapalle","Musunuru","Kowthalam","Kodair","Patancheru","Mattampalle","Ranjal","Nellore","Markapur ","Shabad","Santhakaviti","Paderu","Ramabhadrapuram","Maripeda","Palakoderu",29,null,"Musunuru",30]
[30,"Ichoda","Kudair","Palamaner  ","Pedapadu","Nagaram ",null,"Penagaluru ","Mallial","Nelakondapalle","Mylavaram","Krishnagiri","Kodangal","Pulkal ","Mellachervu","Sadasivanagar","Ojili","Marripudi ","Shamirpet","Saravakota","Padmanabham","Salur","Mogullapalle","Pedapadu",30,null,"Mylavaram",31]
[31,"Jaipur","Kundurpi","Palasamudram ","Pedavegi","Nakarikallu ",null,"Pendlimarri ","Manakondur","Palawancha","Nagayalanka","Kurnool","Koilkonda","Raikode","Miryalaguda","Sirkonda","Pellakur","Martur ","Shamshabad","Sarubujjili","Paravada ","Seethanagaram"," Mulug","Pedavegi",31,null,"Nagayalanka",32]
[32,"Kasipet","Lepakshi","Pedda Panjani  ","Pentapadu","Narasaraopeta ",null,"Porumamilla  ","Manthani","Penuballi ","Nandigama","Maddikera East","Kollapur","Ramachandrapuram","Mothey","Tadwai ","Podlakur","Mundlamuru ","Shankarpalle","Seethampeta","Payakaraopeta ","Srungavarapukota","Nallabelly","Pentapadu",32,null,"Nandigama",33]
[33,"Kouthala","Mudigubba","Peddamandyam  ","Penugonda","Nizampatnam ",null,"Proddutur  ","Medipalle","Pinapaka","Nandivada ","Mahanandi","Kondurg ","Ramayampet ","Mothkur","Varni","Rapur ","Naguluppalapadu","Tandur ","Sompeta","Pedabayalu","Therlam","Narmetta","Penugonda",33,null,"Nandivada ",34]
[34," Lohesra","Nallacheruvu","Peddathippasamudram  ","Penumantra","Nuzendla ",null,"Pulivendla ","Metpalle","Sathupalle ","Nuzvid","Mantralayam","Kosgi","Regode","Munagala","Velpur","Sangam","Ongole ","Uppal","Srikakulam","Pedagantyada","Vepada","Narsampet","Penumantra",34,null,"Nuzvid",35]
[35,"Mandamarri","Nallamada","Penumuru ","Peravali","Pedakakani ",null,"Pullampeta  ","Mustabad","Singareni","Pamarru","Midthur","Kothakota","Sadasivpet","Munugode","Yeda Palle","Seetharamapuram","Pamur ","Vikarabad","Tekkali","Pendurthi","Vizianagaram","Narsimhulapet","Peravali",35,null,"Pamarru",36]
[36,"Neradigonda","Nambulipulikunta"," Pichatur ","Poduru","Pedakurapadu ",null,"Railway Koduru • ","Mutharam Mahadevpur","Thallada","Pamidimukkala","Nandavaram","Kothur","Sangareddy ","Nadigudem","Yellareddy","Sullurpeta","Parchur ","Yacharam","Vajrapukothuru","Rambilli",null,"Nekkonda","Poduru",36,null,"Pamidimukkala",37]
[37,"Sirpur (T)","Narpala"," Pileru ","Polavaram ","Phirangipuram ",null,"Rajampet  ","Mutharam Manthani","Thirumalayapalem","Pedana","Nandi Kotkur","Lingal","Shankarampet (A)","Nakrekal",null,"Sydapuram ","Pedaaraveedu ","Yelal","Vangara","Ravikamatham",null,"Nellikudur","Polavaram ",37,null,"Pedana",38]
[38,"Tandur","Obuladevaracheruvu","Pulicherla  ","T Narasapuram","Piduguralla ",null,"Raju Palem  ","Odela","Vararamachandrapuram","Pedaparupudi","Nandyal","Maddur","Shankarampet (R)","Nalgonda",null,"Tada ","Pedacherlopalle",null,"Veeraghattam","Rolugunta",null,"Palakurthi ","T Narasapuram",38,null,"Pedaparupudi",39]
[39,"Vemanpalle","Pamidi","Punganur ","Tadepalligudem","Pittalavanipalem ",null,"Ramapuram  ","Peddapalle","Velairpad ","Penamaluru","Orvakal","Madgul","Shivampet","Nampalle",null,"Thotapalligudur ","Podili ",null,null,"S Rayavaram ",null,"Parkal","Tadepalligudem",39,null,"Penamaluru",40]
[40,"Bejjur","Parigi","Puthalapattu ","Tanuku","Ponnur ",null,"Rayachoti  ","Pegadapalle","Vemsoor","Penuganchiprolu","Owk","Maganoor","Siddipet ","Narayanapur",null,"Udayagiri ","Ponnaluru ",null,null,"Sabbavaram",null,"Parvathagiri","Tanuku",40,null,"Penuganchiprolu",41]
[41,"Bheemini","Peddapappur  ","Puttur  ","Thallapudi","Prathipadu ",null,"S Mydukur  ","Raikal","Venkatapuram","Reddigudem","Pagidyala","Mahbubnagar","Tekmal","Narketpalle",null,"Vakadu ","Pullalacheruvu ",null,null,"Visakhapatnam",null,"Raghunatha Palle  ","Thallapudi",41,null,"Reddigudem",42]
[42,"Dandepalle","Peddavadugur","Rama Kuppam  ","Undi","Rajupalem ",null,"Sambepalle ","Ramadugu","Wazeed","Thotlavalluru","Pamulapadu","Makthal","Tupran","Nered Cherla",null,"Varikuntapadu ","Racherla ",null,null,"Visakhapatnam(U)",null,"Raiparthy ","Undi",42,null,"Thotlavalluru",43]
[43,"Inderavelly","Penu Konda","Ramachandrapuram ","Undrajavaram","Rentacrintala ",null,"Sidhout  ","Ramagundam","Wyra","Tiruvuru","Panyam","Maldakal","Wargal","Nidamanur",null,"Venkatachalam ","Santhamaguluru ",null,null,"Yelamanchili",null,"Regonda","Undrajavaram",43,null,"Tiruvuru",44]
[44,"Jannaram","Putlur","Ramasamudram  ","Unguturu","Repalle ",null,"Simhadripuram • ","Saidapur","Yellandu","Unguturu","Pattikanda","Manopadu","Yeldurthy","Nuthankal",null,"Venkatagiri ","Santhanuthlapadu ",null,null,null,null,"Sangem","Unguturu",44,null,"Unguturu",45]
[45,"Kerameri","Puttaparthi","Renigunta  ","Veeravasaram","Rompicherla",null,"T Sundupalle  ","Sarangapur","Yerrupalem","Vatsavai ","Peapally","Midjil","Zahirabad","Pedda Adiserlapalle",null,"Vidavalur ","Singarayakonda ",null,null,null,null,"Shayampet","Veeravasaram",45,null,"Vatsavai ",46]
[46,"Kubeer","Ramagiri ","Rompicherla  ","Yelamanchili","Sattenapalle",null,"Thandur ","Sirsilla",null,"Veerullapadu","Pedda Kadubur","Nagar Kurnool",null,"Peddavura",null,"Vinjamur","Tangutur ",null,null,null,null,"Tadvai ","Yelamanchili",46,null,"Veerullapadu",47]
[47,"Luxettipet","Raptadu","Santhi Puram  ",null,"Savalyapuram",null,"Vallur ","Srirampur",null,"Vijayawada Rural","Rudravaram","Narayanpet",null,"Penpahad",null,null,"Tarlapadu ",null,null,null,null,"Thorrur",null,47,null,"Vijayawada Rural",48]
[48,"Mudhole","Roddam","Satyavedu  ",null,"Tadikonda",null,"Veeraballe ","Sultanabad",null,"Vijayawada Urban","Sanjamala ","Narva",null,"Pochampalle",null,null,"Thallur ",null,null,null,null,"Venkatapur",null,48,null,"Vijayawada Urban",49]
[49,"Nirmal","Rolla","Sodam  ",null,"Tenali ",null,"Veerapunayunipalle •","Thimmapur",null,"Vissannapet","Sirvel","Nawabpet",null,"Rajapet",null,null,"Tripuranthakam ",null,null,null,null,"Wardhannapet",null,49,null,"Vissannapet",50]
[50,"Sirpur (U)","Settur","Somala  ",null,"Thadepalle",null,"Vempalle  ","Veenavanka ",null,"Vuyyuru","Srisailam","Pangal",null,"Ramannapeta ",null,null,"Ulavapadu ",null,null,null,null,"Zaffergadh",null,50,null,"Vuyyuru",51]
[51,"Tanur","Singanamala","Srikalahasti ",null,"Thullur",null,"Vemula ","Velgatoor",null,null,"Tuggali","Pebbair",null,"Saligouraram",null,null,"Veligandla ",null,null,null,null,null,null,51,null,0,52]
[52,"Wankdi","Somandepalle","Srirangarajapuram  ",null,"Tsundur",null,"Vontimitta ","Vemulawada",null,null,"Uyyalawada","Peddakothapalle",null,"Suryapet",null,null,"Vetapalem ",null,null,null,null,null,null,52,null,0,53]
[53,null,"Tadimarri ","Thamballapalle ",null,"Vatticherukuru",null,"Yerraguntla","Yella Reddi Peta",null,null,"Veldurthi","Peddamandadi",null,"Thipparthi",null,null,"Voletivaripalem ",null,null,null,null,null,null,53,null,0,54]
[54,null,"Tadpatri ","Thavanampalle ",null,"Veldurthi ",null,null,null,null,null,"Velgodu","Tadoor",null,"Thirumalagiri",null,null,"Yeddanapudi ",null,null,null,null,null,null,54,null,0,55]
[55,null,"Talupula","Thottambedu ",null,"Vemuru",null,null,null,null,null,"Yemmiganur","Talakondapalle",null,"Thripuraram",null,null,"Yerragondapalem ",null,null,null,null,null,null,55,null,0,56]
[56,null,"Tanakal","Tirupati Rural ",null,"Vinukonda",null,null,null,null,null,null,"Telkapalle",null,"Thunga Thurthi",null,null,"Zarugumilli",null,null,null,null,null,null,56,null,0,57]
[57,null,"Uravakonda","Tirupati Urban ",null,null,null,null,null,null,null,null,"Thimmajipeta",null,"Valigonda",null,null,null,null,null,null,null,null,null,57,null,0,58]
[58,null,"Vajrakarur","Vadamalapeta  ",null,null,null,null,null,null,null,null,"Uppununthala",null,"Vemulapalle",null,null,null,null,null,null,null,null,null,58,null,0,59]
[59,null,"Vidapanakal","Varadaiahpalem  ",null,null,null,null,null,null,null,null,"Utkoor",null,"Yadagirigutta",null,null,null,null,null,null,null,null,null,59,null,0,60]
[60,null,"Yadiki","Vayalpad  ",null,null,null,null,null,null,null,null,"Vangoor",null,null,null,null,null,null,null,null,null,null,null,60,null,0,61]
[61,null,"Yellanur","Veduru Kuppam  ",null,null,null,null,null,null,null,null,"Veepangandla",null,null,null,null,null,null,null,null,null,null,null,61,null,0,62]
[62,null,null,"Venkatagiri Kota  ",null,null,null,null,null,null,null,null,"Veldanda",null,null,null,null,null,null,null,null,null,null,null,62,null,0,63]
[63,null,null,"Vijaya Puram  ",null,null,null,null,null,null,null,null,"Waddepalle",null,null,null,null,null,null,null,null,null,null,null,63,null,0,64]
[64,null,null,"Yadamari ",null,null,null,null,null,null,null,null,"Wanaparthy",null,null,null,null,null,null,null,null,null,null,null,64,null,0,65]
[65,null,null,"Yerpedu ",null,null,null,null,null,null,null,null,null,null,null,null,null,null,null,null,null,null,null,null,65,null,{"$f":" HLOOKUP($Z$1,$B$2:$X$68,AB67,FALSE)","v":0},66]
[66,null,null,"Yerravaripalem",null,null,null,null,null,null,null,null,null,null,null,null,null,null,null,null,null,null,null,null,66,null,{"$f":" HLOOKUP($Z$1,$B$2:$X$68,AB68,FALSE)","v":0},67]
[]
[]
[]
[]
[]
[]
[]
[]
[]
[]
[]
[]
[]
[]
[]
[]
[]
[null,null,null,null,null,null,null,null,null,null,null,null,null,null,null,null,null,{"$f":"R88&\"-\"&S88&\"-\"&T87","v":"15-4-2011"},null,null,null,null,{"$f":"W88&\"-\"&X88&\"-\"&Y87","v":"15-6-2012"},null,null,null,null,{"$f":"AB88&\"-\"&AC88&\"-\"&AD87","v":"15-11-2010"}]
[null,null,null,null,null,null,null,null,null,null,null,null,null,null,null,null,null,null,{"$f":"LOOKUP(S88,R89:S100,S89:S100)","v":"Apr"},{"$f":"LOOKUP(T88,R89:T100,T89:T100)","v":2011},null,null,null,{"$f":"LOOKUP(X88,W89:X100,X89:X100)","v":"Jun"},{"$f":"LOOKUP(Y88,W89:Y100,Y89:Y100)","v":2012},null,null,null,{"$f":"LOOKUP(AC88,AB89:AC100,AC89:AC100)","v":"Nov"},{"$f":"LOOKUP(AD88,AB89:AD100,AD89:AD100)","v":2010},{"$f":"LOOKUP(AE88,AB89:AE94,AE89:AE94)","v":"fifth"}]
[null,null,null,null,null,null,null,null,null,null,null,null,null,null,null,null,null,15,4,2,null,null,15,6,3,null,null,15,11,1,5]
[null,null,null,null,null,null,null,null,null,null,null,null,null,null,null,null,null,1,"Jan",2010,null,null,1,"Jan",2010,null,null,1,"Jan",2010,"first"]
[null,null,null,null,null,null,null,null,null,null,null,null,null,null,null,null,null,2,"Feb",2011,null,null,2,"Feb",2011,null,null,2,"Feb",2011,"second"]
[null,null,null,null,null,null,null,null,null,null,null,null,null,null,null,null,null,3,"Mar",2012,null,null,3,"Mar",2012,null,null,3,"Mar",2012,"third"]
[null,null,null,null,null,null,null,null,null,null,null,null,null,null,null,null,null,4,"Apr",2013,null,null,4,"Apr",2013,null,null,4,"Apr",2013,"fourth"]
[null,null,null,null,null,null,null,null,null,null,null,null,null,null,null,null,null,5,"May",null,null,null,5,"May",null,null,null,5,"May",null,"fifth"]
[null,null,null,null,null,null,null,null,null,null,null,null,null,null,null,null,null,6,"Jun",null,null,null,6,"Jun",null,null,null,6,"Jun",null,"sixth"]
[null,null,null,null,null,null,null,null,null,null,null,null,null,null,null,null,null,7,"Jul",null,null,null,7,"Jul",null,null,null,7,"Jul"]
[null,null,null,null,null,null,null,null,null,null,null,null,null,null,null,null,null,8,"Aug",null,null,null,8,"Aug",null,null,null,8,"Aug"]
[null,null,null,null,null,null,null,null,null,null,null,null,null,null,null,null,null,9,"Sep",null,null,null,9,"Sep",null,null,null,9,"Sep"]
[null,null,null,null,null,null,null,null,null,null,null,null,null,null,null,null,null,10,"Oct",null,null,null,10,"Oct",null,null,null,10,"Oct"]
[null,null,null,null,null,null,null,null,null,null,null,null,null,null,null,null,null,11,"Nov",null,null,null,11,"Nov",null,null,null,11,"Nov"]
[null,null,null,null,null,null,null,null,null,null,null,null,null,null,null,null,null,12,"Dec",null,null,null,12,"Dec",null,null,null,12,"Dec"]
[null,null,null,null,null,null,null,null,null,null,null,null,null,null,null,null,null,13,null,null,null,null,13,null,null,null,null,13]
[null,null,null,null,null,null,null,null,null,null,null,null,null,null,null,null,null,14,null,null,null,null,14,null,null,null,null,14]
[null,null,null,null,null,null,null,null,null,null,null,null,null,null,null,null,null,15,null,null,null,null,15,null,null,null,null,15]
[null,null,null,null,null,null,null,null,null,null,null,null,null,null,null,null,null,16,null,null,null,null,16,null,null,null,null,16]
[null,null,null,null,null,null,null,null,null,null,null,null,null,null,null,null,null,17,null,null,null,null,17,null,null,null,null,17]
[null,null,null,null,null,null,null,null,null,null,null,null,null,null,null,null,null,18,null,null,null,null,18,null,null,null,null,18]
[null,null,null,null,null,null,null,null,null,null,null,null,null,null,null,null,null,19,null,null,null,null,19,null,null,null,null,19]
[null,null,null,null,null,null,null,null,null,null,null,null,null,null,null,null,null,20,null,null,null,null,20,null,null,null,null,20]
[null,null,null,null,null,null,null,null,null,null,null,null,null,null,null,null,null,21,null,null,null,null,21,null,null,null,null,21]
[null,null,null,null,null,null,null,null,null,null,null,null,null,null,null,null,null,22,null,null,null,null,22,null,null,null,null,22]
[null,null,null,null,null,null,null,null,null,null,null,null,null,null,null,null,null,23,null,null,null,null,23,null,null,null,null,23]
[null,null,null,null,null,null,null,null,null,null,null,null,null,null,null,null,null,24,null,null,null,null,24,null,null,null,null,24]
[null,null,null,null,null,null,null,null,null,null,null,null,null,null,null,null,null,25,null,null,null,null,25,null,null,null,null,25]
[null,null,null,null,null,null,null,null,null,null,null,null,null,null,null,null,null,26,null,null,null,null,26,null,null,null,null,26]
[null,null,null,null,null,null,null,null,null,null,null,null,null,null,null,null,null,27,null,null,null,null,27,null,null,null,null,27]
[null,null,null,null,null,null,null,null,null,null,null,null,null,null,null,null,null,28,null,null,null,null,28,null,null,null,null,28]
[null,null,null,null,null,null,null,null,null,null,null,null,null,null,null,null,null,29,null,null,null,null,29,null,null,null,null,29]
[null,null,null,null,null,null,null,null,null,null,null,null,null,null,null,null,null,30,null,null,null,null,30,null,null,null,null,30]
[null,null,null,null,null,null,null,null,null,null,null,null,null,null,null,null,null,31,null,null,null,null,31,null,null,null,null,31]

{"sheet":"Mandals2","index":2,"n_rows":119,"n_cols":33,"rows_kept":119,"cut":false,"hidden":true,"merged":[]}
[null,null,null,null,null,null,null,null,null,null,null,null,null,null,null,null,null,null,null,null,null,null,null,null,7,{"$f":"LOOKUP(Y1,Y3:Z25,Z3:Z25)","v":"Kaddapah District"},5,null,null,null,null,10,{"$f":"LOOKUP(AF1,AF3:AG25,AG3:AG25)","v":"Krishan District "}]
[null,"Adilabad ","Anathapuram","Chittoor District","West godavari District ","Guntur District","Hyderabad   District ","kaddapah District","Kareemnagar District ","Khammam District ","Krishan District ","Kurnool District","Mahaboobnagar District ","Medak District ","Nalgonda District ","Nizamabad District ","Nellore District","Prakasam District","Ranga reddy District ","Sreekakulam District ","Visakhapatnam District","Vizianagaram District","Warangal District ","West godavari  District ","S.No","Districts",{"$f":"LOOKUP(AA1,Y3:Y68,AA3:AA68)","v":"Chakrayapet"},null,9,{"$f":"LOOKUP(AC2,Y3:AA68,AA3:AA68)","v":"Chinnamandem "},null,"S.No","Districts"]
[1,"Adilabad ","Agali ","B Kothakota","Achanta","Achampeta",null,"Atlur ","Bheemadevarpalle","Aswapuram ","A Konduru ","Adoni  ","Achampeta","Alladurg","Alair ","Armur ","Allur","Addanki","Balanagar ","Amadalavalasa ","Anakapalli","Badangi","Atmakur  ","Achanta",1,"Adilabad ",{"$f":" HLOOKUP($Z$1,$B$2:$X$68,AB3,FALSE)","v":"Atlur "},2,null,null,null,1,"Adilabad "]
[2,"Narnoor","Amadagur","Baireddi Palle","Akiveedu","Amaravathi ",null,"B Kodur ","Boinpalle","Aswaraopeta","Agiripalle","Allagadda","Addakal","Andole","Anumula","Balkonda","Ananthasagaram","Ardhaveedu","Bantaram","Battili","Anandapuram ","Balajipeta","Bachannapeta","Akiveedu",2,"Anathapuram","B Kodur ",3,null,null,null,2,"Anathapuram"]
[3,"Bela","Amarapuram","Bangarupalem","Attili","Amruthalur ",null,"Badvel ","Chandurthi","Bayyaram","Avanigadda","Alur","Aiza ","Chegunta","Atmakur ","Banswada","Anumasamudrampeta","Ballikuruva ","Basheerabad","Bhamini","Ananthagiri","Bhoghapuram","Bhupalpalle","Attili",3,"Chittoor District","Badvel ",4,null,null,null,3,"Chittoor District"]
[4,"Boath","Anantapur","Buchinaidu Khandriga","Bheemavaram","Bapatla ",null,"Brahmamgarimattam ","Choppadandi","Bhadrachalam ","Bantumilli","Aspari","Alampur","Chinna Kodur","Atmakur","Bheemgal","Atmakur","Bestavaripeta ","Chevella","Burja","Araku Valley","Bobbili","Chennaraopet","Bheemavaram",4,"West godavari District ","Brahmamgarimattam ",5,null,null,null,4,"West godavari District "]
[5,"Dilawarpur","Atmakur","Chandragiri","Bhimadole","Bellamkonda",null,"Chakrayapet","Dharmapuri","Bonakal ","Bapulapadu","Atmakur","Amangal","Doultabad","Bhuvanagiri","Bhiknur","Balayapalli","Chadrasekara Puram  ","Dharur","Etcherla","Atchutapuram ","Bondapalle","Cheriyal","Bhimadole",5,"Guntur District","Chakrayapet",6,null,null,null,5,"Guntur District"]
[6,"Jainad","Bathalapalle","Chinnagottigallu","Buttayagudem","Bhattiprolu ",null,"Chapad ","Dharmaram","Burgampadu","Challapalli ","Banaganapalle","Amrabad","Dubbak","Bibinagar","Bichkunda","Bogole","Chimakurthi ","Domah","Ganguvari Singadam","Bheemunipatnam","Chintalavalasa","Chityal","Buttayagudem",6,"Hyderabad District ","Chapad ",7,null,null,null,6,"Hyderabad District "]
[7,"Kaddampeddur","Beluguppa","Chittoor","Chagallu","Bollapalle ",null,"Chennur","Ellanthakunta","Chandrugonda","Chandarlapadu","Bandi Atmakur","Atmakur","Eddumailaram","Bommalaramaram","Birkoor ","Buchireddipalem","Chinaganjam ","Gandeed","Kaligapatnam","Butchayyapeta ","Cheepurupalle","Devaruppula","Chagallu",7,"Kaddapah District","Chennur",8,null,null,null,7,"Kaddapah District"]
[8,"Khanpur","Bommanahal","Chowdepalle","Chintalapudi","Chebrole ",null,"ChinnaChowk ","Gambhiraopet","Cherla","Chatrai","Bethamcherla","Balanagar","Gajwel","Chandam Pet","Bodhan","Chejerla ","Chirala ","Ghatkesar","Hiramandalam","Cheedikada","Dattirajeru","Dharmasagar","Chintalapudi",8,"Kareemnagar District ","ChinnaChowk ",9,null,null,null,8,"Kareemnagar District "]
[9,"Kuntala","Brahmasamudram ","Gangadhara Nellore","Denduluru","Cherukupalle ",null,"Chinnamandem ","Gangadhara","Chinthakani","G Konduru","Bugganipalle","Balmoor","Hathnoora","Chandur","Dhar Palle","Chillakur ","Cumbum ","Hayathnagar","Ichchapuram","Chintapalle","Denkada","Dornakal","Denduluru",9,"Khammam District ","Chinnamandem ",10,null,null,null,9,"Khammam District "]
[10,"Mamda","Bukkapatnam","Gangavaram  ","Devarapalle","Chilakaluripet ",null,"Chintha Kommadinne ","Gollapalle","Chintur","Gampalagudem","C.Belagal","Bhoothpur ","Jagdevpur","Chilkur","Dich Palle","Chittamur ","Darsi ","Ibrahimpatam","Jalumuru","Chodavaram","Gajapathinagaram","Duggondi","Devarapalle",10,"Krishan District ","Chintha Kommadinne ",11,null,null,null,10,"Krishan District "]
[11,"Rebbana","Bukkarayasamudram","Gudi Palle  ","Dwaraka Tirumala","Dachepalle ",null,"Chitvel ","Husnabad","Dammapeta","Gannavaram","Chagalamarri","Bijinapalle","Jharasangam","Chintha Palle","Domakonda","Dagadarthi ","Donakonda","Kandukur","Kanchili","Devarapalle","Gantyada","Eturnagaram ","Dwaraka Tirumala",11,"Kurnool District","Chitvel ",12,null,null,null,11,"Kurnool District"]
[12,"Talamadugu","Chenne Kothapalle","Gudipala ","Eluru","Duggirala ",null,"Cuddapah ","Huzurabad","Dummugudem","Ghantasala","Chippagiri","Bomraspeta","Jinnaram","Chityala","Gandhari","Dakkili","Dornala ","Keesara","Kaviti","Dumbriguda","Garividi","Geesugonda","Eluru",12,"Mahaboobnagar District ","Cuddapah ",13,null,null,null,12,"Mahaboobnagar District "]
[13,"Tiryani","Chilamathur","Gurramkonda  ","Ganapavaram","Durgi ",null,"Duvvur  ","Ibrahimpatnam","Enkuru","Gudivada","Devanakonda","Chinna Chinta Kunta","Kalher","Chivvemla","Jakranpalle","Doravarisatram","Giddaluru ","Kulkacharla","Kotabommili","Gajuwaka","Garugubilli","Ghanapur","Ganapavaram",13,"Medak District ","Duvvur  ",14,null,null,null,13,"Medak District "]
[14,"Asifabad","D.Hirchal","Irala ","Gopalapuram","Edlapadu",null,"Galiveedu ","Jagtial","Garla","Gudlavalleru","Dhone","Damaragidda","Kohir","Choutuppal","Jukkal","Duttalur ","Gudluru ","Maheswaram","Kothuru ","Gangaraju Madugula","Gummalakshmipuram","Ghanpur(Stn)","Gopalapuram",14,"Nalgonda District ","Galiveedu ",15,null,null,null,14,"Nalgonda District "]
[15,"Bellampalle","Dharmavaram","K V P Puram ","Iragavaram","Guntur ",null,"Gopavaram","Jammikunta","Gundala","Gudur","Dornipadu","Devarkadara","Kondapak","Dameracherla","Kamareddy","Gudur ","Hanumanthunipadu ","Malkajgiri","Laveru","Golugonda","Gurla","Govindaraopet","Iragavaram",15,"Nizamabad District ","Gopavaram",16,null,null,null,15,"Nizamabad District "]
[16,"Chennur","Gandlapenta","Kalakada  ","Jangareddigudem","Gurazala ",null,"Jammalamadugu • ","Julapalle","Julurpad","Ibrahimpatnam","Gadivemula","Dhanwada","Kondapur","Devarakonda","Kammar Palle","Indukurpet ","Inkollu ","Manchal ","Mandasa ","Gudem Kothaveedhi","Jami","Gudur","Jangareddigudem",16,"Nellore District","Jammalamadugu • ",17,null,null,null,16,"Nellore District"]
[17,"Gudihathnur","Garladinne","Kalikiri  ","Jeelugumilli","Ipuru",null,"Kalasapadu ","Kamalapur","Kalluru ","Jaggayyapeta","Gonegandla","Dharur","Kowdipalle","Garide Palle","Kotgiri","Jaladanki ","Janakavaram Panguluru ","Marpalle","Meilaputti","Hukumpeta ","Jiyyamma Valasa","Hanamkonda","Jeelugumilli",17,"Prakasam District","Kalasapadu ",18,null,null,null,17,"Prakasam District"]
[18,"Jainoor","Gooty","Kambhamvaripalle ","Kalla ","Kakumanu",null,"Kamalapuram  ","Kamanpur","Karepalli","Kaikalur","Gospadu","Doulatabad","Kulcharam","Gundala","Lingampet","Kaligiri ","Kandukur ","Medchal ","Nandigam","K Kotapadu","Komarada","Hasanparthy","Kalla ",18,"Ranga reddy District ","Kamalapuram  ",19,null,null,null,18,"Ranga reddy District "]
[19,"Kagaz Nagar","Gorantla","Karvetinagar ","Kamavarapukota","Karempudi",null,"Khajipet ","Karimnagar","Khammam Rural","Kalidindi ","Gudur ","Farooqnagar","Manoor","Gundla Palle","Machareddy","Kaluvoya ","Kanigiri ","Moinabad","Narasannapeta","Kasimkota","Kothavalasa","Jangaon","Kamavarapukota",19,"Sreekakulam District ","Khajipet ",20,null,null,null,19,"Sreekakulam District "]
[20,"Kotapalle","Gudibanda","Kuppam  ","Kovvur","Karlapalem",null,"Kodur  ","Kataram","Khammam Urban","Kanchika Cherla","Halaharvi","Gadwal","Medak ","Gurrampode","Madnur","Kavali ","Karamchedu ","Mominpet","Palakonda","Kotauratla","Kurupam","Kesamudram","Kovvur",20,"Visakhapatnam District","Kodur  ",21,null,null,null,20,"Visakhapatnam District"]
[21,"Laxmanchanda","Gummagatta","Kurabalakota  ","Koyyalagudem","Kollipara ",null,"Kondapuram  ","Kathlapur","Konijerla ","Kankipadu","Holagunda","Ghanpur","Mirdoddi","Huzurnagar","Makloor","Kodavalur ","Komarolu ","Nawabpet","Palasa","Koyyuru","Lakkavarapukota","Khanapur","Koyyalagudem",21,"Vizianagaram District","Kondapuram  ",22,null,null,null,21,"Vizianagaram District"]
[22,"Mancherial","Guntakal ","Mandanpalle  ","Lingapalem","Kollur ",null,"Lakkireddipalle • ","Kesavapatnam","Kothagudem","Koduru ","Jupadu Bungalow","Ghattu","Mulug","Jaji Reddi Gudem","Mortad","Kondapuram","Konakanamitla","Pargi","Pathapatnam","Madugula","Makkuva","Kodakandla","Lingapalem",22,"Warangal District ","Lakkireddipalle • ",23,null,null,null,22,"Warangal District "]
[23,"Nennal","Hindupur ","Mulakalacheruvu ","Mogalthur","Krosuru ",null,"Lingala ","Kodimial ","Kukunoor ","Kruthivennu ","Kallur","Gopalpeta","Munpalle"," Kangal","Naga Reddipet","Kota","Kondapi","Peddemul","Polaki","Makavarapalem","Mentada ","Kothagudem ","Mogalthur",23,"West godavari District ","Lingala ",24,null,null,null,23,"West godavari District "]
[24," Sarangapur","Kadiri ","Nagalapuram  ","Nallajerla","Machavaram ",null,"Muddanur  ","Koheda","Kunavaram","Machilipatnam","Kodumur","Hanwada","Nanganur","Kattangoor","Nandipet ","Kovur","Korisapadu ","Pudur","Ponduru","Munagapaka","Merakamudidam","Kuravi ","Nallajerla",24,null,"Muddanur  ",25]
[25,"Tamsi","Kalyandurg","Nagari  ","Narasapuram","Macherla ",null,"Mylavaram ","Konaraopeta","Kusumanchi","Mandavalli","Koilkuntla","Itikyal ","Narayankhed","Kethepalle","Navipet ","Manubolu","Kothapatnam","Quthbullapur","Rajam","Munchingiputtu ","Nellimarla","Lingala Ghanpur","Narasapuram",25,null,"Mylavaram ",26]
[26,"Utnur","Kambadur","Narayanavanam  ","Nidadavole","Mangalagiri",null,"Mydukur  ","Koratla","Madhira","Mopidevi","Kolimigundla ","Jadcherla","Narsapur","Kodad ","Nizam Sagar","Marripadu","Kurichedu ","Rajendranagar ","Ranastalam","Nakkapalli","Pachipenta","Maddur","Nidadavole",26,null,"Mydukur  ",27]
[27,"Bazarhathnoor","Kanaganapalle","Nimmanapalle  ","Nidamarru","Medikonduru ",null,"Nandalur  ","Mahadevpur","Manuguru ","Movva","Kosigi ","Kalwakurthy","Nyalkal","M Turkapalle","Nizamabad","Muthukur","Lingasamudram ","Saroornagar"," Regidiamadalavalasa ","Narsipatnam","Parvathipuram","Mahabubabad","Nidamarru",27,null,"Nandalur  ",28]
[28,"Bhainsa","Kanekal","Nindra  ","Palacole","Muppalla",null,"Obulavaripalle  ","Malharrao","Mudigonda","Mudinepalli","Kothapalle","Keshampeta ","Papannapet","Marri Guda ","Pitlam","Naidupeta","Maddipadu ","Serilingampalle","Santhabommali ","Nathavaram","Pusapatirega","Mangapet","Palacole",28,null,"Obulavaripalle  ",29]
[29,"Dahegaon","Kothacheruvu","Pakala  ","Palakoderu","Nadendla ",null,"Peddamudium • ","Mallapur","Mulakalapalle","Musunuru","Kowthalam","Kodair","Patancheru","Mattampalle","Ranjal","Nellore","Markapur ","Shabad","Santhakaviti","Paderu","Ramabhadrapuram","Maripeda","Palakoderu",29,null,"Peddamudium • ",30]
[30,"Ichoda","Kudair","Palamaner  ","Pedapadu","Nagaram ",null,"Penagaluru ","Mallial","Nelakondapalle","Mylavaram","Krishnagiri","Kodangal","Pulkal ","Mellachervu","Sadasivanagar","Ojili","Marripudi ","Shamirpet","Saravakota","Padmanabham","Salur","Mogullapalle","Pedapadu",30,null,"Penagaluru ",31]
[31,"Jaipur","Kundurpi","Palasamudram ","Pedavegi","Nakarikallu ",null,"Pendlimarri ","Manakondur","Palawancha","Nagayalanka","Kurnool","Koilkonda","Raikode","Miryalaguda","Sirkonda","Pellakur","Martur ","Shamshabad","Sarubujjili","Paravada ","Seethanagaram"," Mulug","Pedavegi",31,null,"Pendlimarri ",32]
[32,"Kasipet","Lepakshi","Pedda Panjani  ","Pentapadu","Narasaraopeta ",null,"Porumamilla  ","Manthani","Penuballi ","Nandigama","Maddikera East","Kollapur","Ramachandrapuram","Mothey","Tadwai ","Podlakur","Mundlamuru ","Shankarpalle","Seethampeta","Payakaraopeta ","Srungavarapukota","Nallabelly","Pentapadu",32,null,"Porumamilla  ",33]
[33,"Kouthala","Mudigubba","Peddamandyam  ","Penugonda","Nizampatnam ",null,"Proddutur  ","Medipalle","Pinapaka","Nandivada ","Mahanandi","Kondurg ","Ramayampet ","Mothkur","Varni","Rapur ","Naguluppalapadu","Tandur ","Sompeta","Pedabayalu","Therlam","Narmetta","Penugonda",33,null,"Proddutur  ",34]
[34," Lohesra","Nallacheruvu","Peddathippasamudram  ","Penumantra","Nuzendla ",null,"Pulivendla ","Metpalle","Sathupalle ","Nuzvid","Mantralayam","Kosgi","Regode","Munagala","Velpur","Sangam","Ongole ","Uppal","Srikakulam","Pedagantyada","Vepada","Narsampet","Penumantra",34,null,"Pulivendla ",35]
[35,"Mandamarri","Nallamada","Penumuru ","Peravali","Pedakakani ",null,"Pullampeta  ","Mustabad","Singareni","Pamarru","Midthur","Kothakota","Sadasivpet","Munugode","Yeda Palle","Seetharamapuram","Pamur ","Vikarabad","Tekkali","Pendurthi","Vizianagaram","Narsimhulapet","Peravali",35,null,"Pullampeta  ",36]
[36,"Neradigonda","Nambulipulikunta"," Pichatur ","Poduru","Pedakurapadu ",null,"Railway Koduru • ","Mutharam Mahadevpur","Thallada","Pamidimukkala","Nandavaram","Kothur","Sangareddy ","Nadigudem","Yellareddy","Sullurpeta","Parchur ","Yacharam","Vajrapukothuru","Rambilli",null,"Nekkonda","Poduru",36,null,"Railway Koduru • ",37]
[37,"Sirpur (T)","Narpala"," Pileru ","Polavaram ","Phirangipuram ",null,"Rajampet  ","Mutharam Manthani","Thirumalayapalem","Pedana","Nandi Kotkur","Lingal","Shankarampet (A)","Nakrekal",null,"Sydapuram ","Pedaaraveedu ","Yelal","Vangara","Ravikamatham",null,"Nellikudur","Polavaram ",37,null,"Rajampet  ",38]
[38,"Tandur","Obuladevaracheruvu","Pulicherla  ","T Narasapuram","Piduguralla ",null,"Raju Palem  ","Odela","Vararamachandrapuram","Pedaparupudi","Nandyal","Maddur","Shankarampet (R)","Nalgonda",null,"Tada ","Pedacherlopalle",null,"Veeraghattam","Rolugunta",null,"Palakurthi ","T Narasapuram",38,null,"Raju Palem  ",39]
[39,"Vemanpalle","Pamidi","Punganur ","Tadepalligudem","Pittalavanipalem ",null,"Ramapuram  ","Peddapalle","Velairpad ","Penamaluru","Orvakal","Madgul","Shivampet","Nampalle",null,"Thotapalligudur ","Podili ",null,null,"S Rayavaram ",null,"Parkal","Tadepalligudem",39,null,"Ramapuram  ",40]
[40,"Bejjur","Parigi","Puthalapattu ","Tanuku","Ponnur ",null,"Rayachoti  ","Pegadapalle","Vemsoor","Penuganchiprolu","Owk","Maganoor","Siddipet ","Narayanapur",null,"Udayagiri ","Ponnaluru ",null,null,"Sabbavaram",null,"Parvathagiri","Tanuku",40,null,"Rayachoti  ",41]
[41,"Bheemini","Peddapappur  ","Puttur  ","Thallapudi","Prathipadu ",null,"S Mydukur  ","Raikal","Venkatapuram","Reddigudem","Pagidyala","Mahbubnagar","Tekmal","Narketpalle",null,"Vakadu ","Pullalacheruvu ",null,null,"Visakhapatnam",null,"Raghunatha Palle  ","Thallapudi",41,null,"S Mydukur  ",42]
[42,"Dandepalle","Peddavadugur","Rama Kuppam  ","Undi","Rajupalem ",null,"Sambepalle ","Ramadugu","Wazeed","Thotlavalluru","Pamulapadu","Makthal","Tupran","Nered Cherla",null,"Varikuntapadu ","Racherla ",null,null,"Visakhapatnam(U)",null,"Raiparthy ","Undi",42,null,"Sambepalle ",43]
[43,"Inderavelly","Penu Konda","Ramachandrapuram ","Undrajavaram","Rentacrintala ",null,"Sidhout  ","Ramagundam","Wyra","Tiruvuru","Panyam","Maldakal","Wargal","Nidamanur",null,"Venkatachalam ","Santhamaguluru ",null,null,"Yelamanchili",null,"Regonda","Undrajavaram",43,null,"Sidhout  ",44]
[44,"Jannaram","Putlur","Ramasamudram  ","Unguturu","Repalle ",null,"Simhadripuram • ","Saidapur","Yellandu","Unguturu","Pattikanda","Manopadu","Yeldurthy","Nuthankal",null,"Venkatagiri ","Santhanuthlapadu ",null,null,null,null,"Sangem","Unguturu",44,null,"Simhadripuram • ",45]
[45,"Kerameri","Puttaparthi","Renigunta  ","Veeravasaram","Rompicherla",null,"T Sundupalle  ","Sarangapur","Yerrupalem","Vatsavai ","Peapally","Midjil","Zahirabad","Pedda Adiserlapalle",null,"Vidavalur ","Singarayakonda ",null,null,null,null,"Shayampet","Veeravasaram",45,null,"T Sundupalle  ",46]
[46,"Kubeer","Ramagiri ","Rompicherla  ","Yelamanchili","Sattenapalle",null,"Thandur ","Sirsilla",null,"Veerullapadu","Pedda Kadubur","Nagar Kurnool",null,"Peddavura",null,"Vinjamur","Tangutur ",null,null,null,null,"Tadvai ","Yelamanchili",46,null,"Thandur ",47]
[47,"Luxettipet","Raptadu","Santhi Puram  ",null,"Savalyapuram",null,"Vallur ","Srirampur",null,"Vijayawada Rural","Rudravaram","Narayanpet",null,"Penpahad",null,null,"Tarlapadu ",null,null,null,null,"Thorrur",null,47,null,"Vallur ",48]
[48,"Mudhole","Roddam","Satyavedu  ",null,"Tadikonda",null,"Veeraballe ","Sultanabad",null,"Vijayawada Urban","Sanjamala ","Narva",null,"Pochampalle",null,null,"Thallur ",null,null,null,null,"Venkatapur",null,48,null,"Veeraballe ",49]
[49,"Nirmal","Rolla","Sodam  ",null,"Tenali ",null,"Veerapunayunipalle •","Thimmapur",null,"Vissannapet","Sirvel","Nawabpet",null,"Rajapet",null,null,"Tripuranthakam ",null,null,null,null,"Wardhannapet",null,49,null,"Veerapunayunipalle •",50]
[50,"Sirpur (U)","Settur","Somala  ",null,"Thadepalle",null,"Vempalle  ","Veenavanka ",null,"Vuyyuru","Srisailam","Pangal",null,"Ramannapeta ",null,null,"Ulavapadu ",null,null,null,null,"Zaffergadh",null,50,null,"Vempalle  ",51]
[51,"Tanur","Singanamala","Srikalahasti ",null,"Thullur",null,"Vemula ","Velgatoor",null,null,"Tuggali","Pebbair",null,"Saligouraram",null,null,"Veligandla ",null,null,null,null,null,null,51,null,"Vemula ",52]
[52,"Wankdi","Somandepalle","Srirangarajapuram  ",null,"Tsundur",null,"Vontimitta ","Vemulawada",null,null,"Uyyalawada","Peddakothapalle",null,"Suryapet",null,null,"Vetapalem ",null,null,null,null,null,null,52,null,"Vontimitta ",53]
[53,null,"Tadimarri ","Thamballapalle ",null,"Vatticherukuru",null,"Yerraguntla","Yella Reddi Peta",null,null,"Veldurthi","Peddamandadi",null,"Thipparthi",null,null,"Voletivaripalem ",null,null,null,null,null,null,53,null,"Yerraguntla",54]
[54,null,"Tadpatri ","Thavanampalle ",null,"Veldurthi ",null,null,null,null,null,"Velgodu","Tadoor",null,"Thirumalagiri",null,null,"Yeddanapudi ",null,null,null,null,null,null,54,null,0,55]
[55,null,"Talupula","Thottambedu ",null,"Vemuru",null,null,null,null,null,"Yemmiganur","Talakondapalle",null,"Thripuraram",null,null,"Yerragondapalem ",null,null,null,null,null,null,55,null,0,56]
[56,null,"Tanakal","Tirupati Rural ",null,"Vinukonda",null,null,null,null,null,null,"Telkapalle",null,"Thunga Thurthi",null,null,"Zarugumilli",null,null,null,null,null,null,56,null,0,57]
[57,null,"Uravakonda","Tirupati Urban ",null,null,null,null,null,null,null,null,"Thimmajipeta",null,"Valigonda",null,null,null,null,null,null,null,null,null,57,null,0,58]
[58,null,"Vajrakarur","Vadamalapeta  ",null,null,null,null,null,null,null,null,"Uppununthala",null,"Vemulapalle",null,null,null,null,null,null,null,null,null,58,null,0,59]
[59,null,"Vidapanakal","Varadaiahpalem  ",null,null,null,null,null,null,null,null,"Utkoor",null,"Yadagirigutta",null,null,null,null,null,null,null,null,null,59,null,0,60]
[60,null,"Yadiki","Vayalpad  ",null,null,null,null,null,null,null,null,"Vangoor",null,null,null,null,null,null,null,null,null,null,null,60,null,0,61]
[61,null,"Yellanur","Veduru Kuppam  ",null,null,null,null,null,null,null,null,"Veepangandla",null,null,null,null,null,null,null,null,null,null,null,61,null,0,62]
[62,null,null,"Venkatagiri Kota  ",null,null,null,null,null,null,null,null,"Veldanda",null,null,null,null,null,null,null,null,null,null,null,62,null,0,63]
[63,null,null,"Vijaya Puram  ",null,null,null,null,null,null,null,null,"Waddepalle",null,null,null,null,null,null,null,null,null,null,null,63,null,0,64]
[64,null,null,"Yadamari ",null,null,null,null,null,null,null,null,"Wanaparthy",null,null,null,null,null,null,null,null,null,null,null,64,null,0,65]
[65,null,null,"Yerpedu ",null,null,null,null,null,null,null,null,null,null,null,null,null,null,null,null,null,null,null,null,65,null,{"$f":" HLOOKUP($Z$1,$B$2:$X$68,AB67,FALSE)","v":0},66]
[66,null,null,"Yerravaripalem",null,null,null,null,null,null,null,null,null,null,null,null,null,null,null,null,null,null,null,null,66,null,{"$f":" HLOOKUP($Z$1,$B$2:$X$68,AB68,FALSE)","v":0},67]
[]
[]
[]
[]
[]
[]
[]
[]
[]
[]
[]
[]
[]
[]
[]
[]
[]
[]
[]
[null,null,null,null,null,null,null,null,null,null,null,null,null,null,null,null,null,15,null,null,null,null,15,null,null,null,null,15]
[null,null,null,null,null,null,null,null,null,null,null,null,null,null,null,null,null,1,null,null,null,null,1,null,null,null,null,1]
[null,null,null,null,null,null,null,null,null,null,null,null,null,null,null,null,null,2,null,null,null,null,2,null,null,null,null,2]
[null,null,null,null,null,null,null,null,null,null,null,null,null,null,null,null,null,3,null,null,null,null,3,null,null,null,null,3]
[null,null,null,null,null,null,null,null,null,null,null,null,null,null,null,null,null,4,null,null,null,null,4,null,null,null,null,4]
[null,null,null,null,null,null,null,null,null,null,null,null,null,null,null,null,null,5,null,null,null,null,5,null,null,null,null,5]
[null,null,null,null,null,null,null,null,null,null,null,null,null,null,null,null,null,6,null,null,null,null,6,null,null,null,null,6]
[null,null,null,null,null,null,null,null,null,null,null,null,null,null,null,null,null,7,null,null,null,null,7,null,null,null,null,7]
[null,null,null,null,null,null,null,null,null,null,null,null,null,null,null,null,null,8,null,null,null,null,8,null,null,null,null,8]
[null,null,null,null,null,null,null,null,null,null,null,null,null,null,null,null,null,9,null,null,null,null,9,null,null,null,null,147]
[null,null,null,null,null,null,null,null,null,null,null,null,null,null,null,null,null,10,null,null,null,null,10,null,null,null,null,10]
[null,null,null,null,null,null,null,null,null,null,null,null,null,null,null,null,null,11,null,null,null,null,11,null,null,null,null,11]
[null,null,null,null,null,null,null,null,null,null,null,null,null,null,null,null,null,12,null,null,null,null,12,null,null,null,null,12]
[null,null,null,null,null,null,null,null,null,null,null,null,null,null,null,null,null,13,null,null,null,null,13,null,null,null,null,13]
[null,null,null,null,null,null,null,null,null,null,null,null,null,null,null,null,null,14,null,null,null,null,14,null,null,null,null,14]
[null,null,null,null,null,null,null,null,null,null,null,null,null,null,null,null,null,15,null,null,null,null,15,null,null,null,null,15]
[null,null,null,null,null,null,null,null,null,null,null,null,null,null,null,null,null,16,null,null,null,null,16,null,null,null,null,16]
[null,null,null,null,null,null,null,null,null,null,null,null,null,null,null,null,null,17,null,null,null,null,17,null,null,null,null,17]
[null,null,null,null,null,null,null,null,null,null,null,null,null,null,null,null,null,18,null,null,null,null,18,null,null,null,null,18]
[null,null,null,null,null,null,null,null,null,null,null,null,null,null,null,null,null,19,null,null,null,null,19,null,null,null,null,19]
[null,null,null,null,null,null,null,null,null,null,null,null,null,null,null,null,null,20,null,null,null,null,20,null,null,null,null,20]
[null,null,null,null,null,null,null,null,null,null,null,null,null,null,null,null,null,21,null,null,null,null,21,null,null,null,null,21]
[null,null,null,null,null,null,null,null,null,null,null,null,null,null,null,null,null,22,null,null,null,null,22,null,null,null,null,22]
[null,null,null,null,null,null,null,null,null,null,null,null,null,null,null,null,null,23,null,null,null,null,23,null,null,null,null,23]
[null,null,null,null,null,null,null,null,null,null,null,null,null,null,null,null,null,24,null,null,null,null,24,null,null,null,null,24]
[null,null,null,null,null,null,null,null,null,null,null,null,null,null,null,null,null,25,null,null,null,null,25,null,null,null,null,25]
[null,null,null,null,null,null,null,null,null,null,null,null,null,null,null,null,null,26,null,null,null,null,26,null,null,null,null,26]
[null,null,null,null,null,null,null,null,null,null,null,null,null,null,null,null,null,27,null,null,null,null,27,null,null,null,null,27]
[null,null,null,null,null,null,null,null,null,null,null,null,null,null,null,null,null,28,null,null,null,null,28,null,null,null,null,28]
[null,null,null,null,null,null,null,null,null,null,null,null,null,null,null,null,null,29,null,null,null,null,29,null,null,null,null,29]
[null,null,null,null,null,null,null,null,null,null,null,null,null,null,null,null,null,30,null,null,null,null,30,null,null,null,null,30]
[null,null,null,null,null,null,null,null,null,null,null,null,null,null,null,null,null,31,null,null,null,null,31,null,null,null,null,31]

{"sheet":"Rec. Hos","index":3,"n_rows":487,"n_cols":15,"rows_kept":487,"cut":false,"hidden":true,"merged":[[0,1,0,6]]}
[null,"LIST OF RECOGNIZED PRIVATE HOSPITALS"]
[null,"S.  NO.","Name of the Hospital","Date of Recognition /Renewal","Proceedings No.","Specialization  for which recognized","Last Date for expriy of recongition",null,null,null,null,null,null,null,"Details"]
[null,1,"A.P. Super Speciality Dental Hospital PVT Ltd,Road No. 2, Banjara Hills, Hyderabad.",{"$f":"I3","v":"11-Sep-2006"},{"$f":"J3","v":"19761/LC-B/2005"},{"$f":"K3","v":"Dental"},{"$f":"L3","v":"10-Sep-2009"},"A.P. Super Speciality Dental Hospital PVT Ltd,\nRoad No. 2, Banjara Hills, Hyderabad.","11-Sep-2006","19761/LC-B/2005","Dental","10-Sep-2009",null,null,{"$f":"LOOKUP(Code!$N$1,'Rec. Hos'!$B$3:$G$487,'Rec. Hos'!C3:C487)","v":"Venkatapadma Hospitals, 15-1-45, Three\nLamps Junction, Beside Masjid, Vizianagaram"}]
[null,2,"A.P.Super Speciality Dental Hospital, Plot No.265J, Road No.10, Jubilee Hills, Hyderabad","04-Jan-2010","37283/LC-B/2009","Dental","03-Jan-2013","A.P.Super Speciality Dental Hospital, Plot No.\n265J, Road No.10, Jubilee Hills, Hyderabad","04-Jan-2010","37283/LC-B/2009","Dental","03-Jan-2013",null,null,{"$f":"DAY(LOOKUP(Code!$N$1,'Rec. Hos'!$B$3:$G$487,'Rec. Hos'!D3:D487))&\"-\"&MONTH(LOOKUP(Code!$N$1,'Rec. Hos'!$B$3:$G$487,'Rec. Hos'!D3:D487))&\"-\"&YEAR(LOOKUP(Code!$N$1,'Rec. Hos'!$B$3:$G$487,'Rec. Hos'!D3:D487))","v":"18-2-2010"}]
[null,3,"A.V.R. Dento - Facial Hospital, Street No. 8\nHabshiguda, Hyderabad.","6-Jan-2009","38917/LC.B/2008","Dental","5-Jan-2012","A.V.R. Dento - Facial Hospital, Street No. 8\nHabshiguda, Hyderabad.","6-Jan-2009","38917/LC.B/2008","Dental","5-Jan-2012",null,null,{"$f":"LOOKUP(Code!$N$1,'Rec. Hos'!$B$3:$G$487,'Rec. Hos'!E3:E487)","v":"34435/LC-B/2009"}]
[null,4,"Aayushman Hospital, Srirangam Street, Near\nVenkateswara Cology, Kurnool","2008-07-03","37591/LC.B/2006","Genl. Medicine, Genl. Surgery, OBG.,\n Orthopedics, Pediatrics, Neuro\n Surgery, ENT., Physiotherapy,\n Radiology, Anesthesiology, Emergency\n Medicine, Plastic Surgery,\n Pulmonology, Surgical Gastro\n Enterology, Urology, and Cardiology.","2011-07-02","Aayushman Hospital, Srirangam Street, Near\nVenkateswara Cology, Kurnool","2008-07-03","37591/LC.B/2006","Genl. Medicine, Genl. Surgery, OBG.,\n Orthopedics, Pediatrics, Neuro\n Surgery, ENT., Physiotherapy,\n Radiology, Anesthesiology, Emergency\n Medicine, Plastic Surgery,\n Pulmonology, Surgical Gastro\n Enterology, Urology, and Cardiology.","2011-07-02",null,null,{"$f":"LOOKUP(Code!$N$1,'Rec. Hos'!$B$3:$G$487,'Rec. Hos'!F3:F487)","v":"General Medicine, General Surgery,\n Anaesthesiology, OBG, Orthopaedics,\n Neuro Surgery, ENT, Urology,\n Paediatrics, Radiology, Pathology,\n Plastic Surgery, Pulmonoogy and\n Physiotherapy"}]
[null,5,"Abhilash Netra Vydyasala, 3/1350, Gandhi\nRoad, Opp. Ishwarya Complex, Proddutur,\nKadapa Dist.","18-Feb-2010","22349/LC-B/2010","Ophthalmology","17-Feb-2013","Abhilash Netra Vydyasala, 3/1350, Gandhi\nRoad, Opp. Ishwarya Complex, Proddutur,\nKadapa Dist.","18-Feb-2010","22349/LC-B/2010","Ophthalmology","17-Feb-2013",null,null,{"$f":"DAY(LOOKUP(Code!$N$1,'Rec. Hos'!$B$3:$G$487,'Rec. Hos'!G3:G487))&\"-\"&MONTH(LOOKUP(Code!$N$1,'Rec. Hos'!$B$3:$G$487,'Rec. Hos'!G3:G487))&\"-\"&YEAR(LOOKUP(Code!$N$1,'Rec. Hos'!$B$3:$G$487,'Rec. Hos'!G3:G487))","v":"17-2-2013"}]
[null,6,"Aditya Hospital, 4-1-16, Boggulakunta, Tilak\nRoad, Abids, Hyderabad.","2006-07-22","18537/LC-B/2005","Multi","2012-07-21","Aditya Hospital, 4-1-16, Boggulakunta, Tilak\nRoad, Abids, Hyderabad.","2006-07-22","18537/LC-B/2005","Multi","2012-07-21"]
[null,7,"Aditya Hospital, Opp. Police Parade Grounds\nBus Stop, Near Petrol Pump, Hanumakonda,\nWarangal.","15-Sep-2008","12309/LC.B/2008","General Surgery.","14-Sep-2011","Aditya Hospital, Opp. Police Parade Grounds\nBus Stop, Near Petrol Pump, Hanumakonda,\nWarangal.","15-Sep-2008","12309/LC.B/2008","General Surgery.","14-Sep-2011"]
[null,8,"Advally Damodar Reddy Memorial Hospital, 9-2, Ramanthapur, Hyderabad","2010-03-11","\n 32471/LC-B/2009","General Medicine, General Surgery,Cardiology, OBG, Orthopaedics, ENT,\n Paediatrics, Nephrology and Plastic\n Surgery","2013-03-10","Advally Damodar Reddy Memorial Hospital, 9-\n2, Ramanthapur, Hyderabad","2010-03-11","\n 32471/LC-B/2009","General Medicine, General Surgery,Cardiology, OBG, Orthopaedics, ENT,\n Paediatrics, Nephrology and Plastic\n Surgery","2013-03-10"]
[null,9,"Akira Eye Hospital, Aryapuram, Rajahmundry,E.G. Dist.","6-Jan-2009","8163/LC.B/2007","Ophthalmology","5-Jan-2012","Akira Eye Hospital, Aryapuram, Rajahmundry,\nE.G. Dist.","6-Jan-2009","8163/LC.B/2007","Ophthalmology","5-Jan-2012"]
[null,10,"Alluri Sitarama Raju Academy of Medical\nSciences and Hospital, N.H. 5, Malkapuram,\nEluru, W.G. Dist."," 3-Feb-2009","\n 32484/LC.B/2007","Genl. Medicine, Genl. Surgery, E.N.T.,\n Pediatrics, OBG., Pulmanology,\n Urology, Cardiology, Neuro Surgery\n and Nephrology.","2012-02-02","Alluri Sitarama Raju Academy of Medical\nSciences and Hospital, N.H. 5, Malkapuram,\nEluru, W.G. Dist."," 3-Feb-2009","\n 32484/LC.B/2007","Genl. Medicine, Genl. Surgery, E.N.T.,\n Pediatrics, OBG., Pulmanology,\n Urology, Cardiology, Neuro Surgery\n and Nephrology.","2012-02-02"]
[null,11,"Alpha Hospital, 23-1-863, Near MCH\nSwimmingpool, Moghalpura, Hyderabad","2006-07-22","14060/LC-B/2005","General Medicine, General Surgery,\n Emesrgency Medicine, Cardiology,\n OBG, Paediatrics, Nephrology,\n Urology, Orthopaedics, Pulmonology,\n Plastic Surgeryand Physiotherapy","2012-07-21","Alpha Hospital, 23-1-863, Near MCH\nSwimmingpool, Moghalpura, Hyderabad","2006-07-22","14060/LC-B/2005","General Medicine, General Surgery,\n Emesrgency Medicine, Cardiology,\n OBG, Paediatrics, Nephrology,\n Urology, Orthopaedics, Pulmonology,\n Plastic Surgeryand Physiotherapy","2012-07-21"]
[null,12,"Amaravathi Institute of Medical Science Pvt.\nLtd., Kothapet, Guntur","2006-03-18","1672/LC-B/2004","Anaesthesiology, General Medicine,\n General Surgery, Emergency Medicine,\n Nephrology, Neuro Surgery, OBG,\n Orthopaedics, Paediatrics, ENT,\n Plastic Surgery, Urology, Radiology\n and Physiotherapy","2012-03-17","Amaravathi Institute of Medical Science Pvt.\nLtd., Kothapet, Guntur","2006-03-18","1672/LC-B/2004","Anaesthesiology, General Medicine,\n General Surgery, Emergency Medicine,\n Nephrology, Neuro Surgery, OBG,\n Orthopaedics, Paediatrics, ENT,\n Plastic Surgery, Urology, Radiology\n and Physiotherapy","2012-03-17"]
[null,13,"Ameerpet Super Speciality Dental Hospital &\nImplant Centre, 102 Classic Avenue, 6-3-\n790/7, Behind chowdary Mansion, Ameerpet,\nHyderabad.","2005-10-24"," 18484/LC-B/2005"," Dental","2008-10-23","Ameerpet Super Speciality Dental Hospital &\nImplant Centre, 102 Classic Avenue, 6-3-\n790/7, Behind chowdary Mansion, Ameerpet,\nHyderabad.","2005-10-24"," 18484/LC-B/2005"," Dental","2008-10-23"]
[null,14,"American Institute of Dentistry, Besides\nChermas, 8-3-944/12/4, Ameerpet,\nHyderabad.","2006-01-19","19963/LC-B/2005"," Dental","2012-01-18","American Institute of Dentistry, Besides\nChermas, 8-3-944/12/4, Ameerpet,\nHyderabad.","2006-01-19","19963/LC-B/2005"," Dental","2012-01-18"]
[null,15,"Amma Hospital, Madhava Nagar, Beside Siva\nRamalayam, Nandyal Road, Kurnool","2008-08-13","25957/LC.B/2005","Genl. Medicine, Genl. Surgery, Neuro\n Surgery, Orthopedics, Urology, OBG.,\n Pulmanology, Neurology, Pediatrics,\n and E.N.T.","2011-08-12","Amma Hospital, Madhava Nagar, Beside Siva\nRamalayam, Nandyal Road, Kurnool","2008-08-13","25957/LC.B/2005","Genl. Medicine, Genl. Surgery, Neuro\n Surgery, Orthopedics, Urology, OBG.,\n Pulmanology, Neurology, Pediatrics,\n and E.N.T.","2011-08-12"]
[null,16,"Amrutha Children Nursing Home, 5-10-15,\nKishanpura, Hanamkonda, Warangal, Dist.","24-Jul-2009","12485/LC-B/2008","Paediatrics","23-Jul-2012","Amrutha Children Nursing Home, 5-10-15,\nKishanpura, Hanamkonda, Warangal, Dist.","24-Jul-2009","12485/LC-B/2008","Paediatrics","23-Jul-2012"]
[null,17,"Amrutha Nursing Home, Besides Civil\nHospital, Karimnagar.","2007-09-13","22904/LC.B.2006","General Medicine, General Surgery,\n OBG, Urology, Physio Therapy, Plastic\n Surgery, Pediatric Surgery, Emergency\n Medicine, Orthopedics, and Surgical\n Oncology.","2010-09-12","Amrutha Nursing Home, Besides Civil\nHospital, Karimnagar.","2007-09-13","22904/LC.B.2006","General Medicine, General Surgery,\n OBG, Urology, Physio Therapy, Plastic\n Surgery, Pediatric Surgery, Emergency\n Medicine, Orthopedics, and Surgical\n Oncology.","2010-09-12"]
[null,18,"Amulya Multi Spefciality Dental Clinic, 12-13-\n1282, Mehtab Arcade, Opp. Ganesh Temple,\nTarnaka 'X' Road, Secunderabad","3-Jul-2010","21023/LC-B/2010","Dental","2-Jul-2013","Amulya Multi Spefciality Dental Clinic, 12-13-\n1282, Mehtab Arcade, Opp. Ganesh Temple,\nTarnaka 'X' Road, Secunderabad","3-Jul-2010","21023/LC-B/2010","Dental","2-Jul-2013"]
[null,19,"Amulya Nursing Home, Narasaropet, Guntur\nDist.","23-Apr-2008","48571/LC.B/2007","Orthopedics","22-Apr-2011","Amulya Nursing Home, Narasaropet, Guntur\nDist.","23-Apr-2008","48571/LC.B/2007","Orthopedics","22-Apr-2011"]
[null,20,"Anasuya Institute of Medical Sciences,\nPogathota, Nellore.","2008-04-23","25778/LC.B/2007","Genl. Medicine, Genl. Surgery,\n Cardiology, Pediatrics, OBG, and\n Orthopedics. Additionally\n Recognised for the following\n specialities w.e.f. 23-12-2009 1.ENT\n 2.Urology 3.C.T.Surgery","2011-04-22","Anasuya Institute of Medical Sciences,\nPogathota, Nellore.","2008-04-23","25778/LC.B/2007","Genl. Medicine, Genl. Surgery,\n Cardiology, Pediatrics, OBG, and\n Orthopedics. Additionally\n Recognised for the following\n specialities w.e.f. 23-12-2009 1.ENT\n 2.Urology 3.C.T.Surgery","2011-04-22"]
[null,21,"Andhra Hospitals, CVR Complex, Prakasam\nRoad, Vijayawada","2006-05-06","3264/LC.B/2004","General Medicine, General Surgery,\n Orthopaedics, OBG, Surgical\n Gastroenterology, Surgical Oncology,\n Nephrology, Urology, Paediatrics and\n Neuro Surgery","2012-05-05","Andhra Hospitals, CVR Complex, Prakasam\nRoad, Vijayawada","2006-05-06","3264/LC.B/2004","General Medicine, General Surgery,\n Orthopaedics, OBG, Surgical\n Gastroenterology, Surgical Oncology,\n Nephrology, Urology, Paediatrics and\n Neuro Surgery","2012-05-05"]
[null,22,"Ankith Multi SpecialtyHospital, Ibrahim\nPatnam, R.R. Dist.","2007-04-28","18815/LC-B/2005","General Medicine, General Surgery,\n Anaesthesiology, OBG, Paediatrics,\n Orthopaedics, ENT, Urology, Neuro\n Surgery, Plastic Surgery and\n Pulmonology","2013-04-27","Ankith Multi SpecialtyHospital, Ibrahim\nPatnam, R.R. Dist.","2007-04-28","18815/LC-B/2005","General Medicine, General Surgery,\n Anaesthesiology, OBG, Paediatrics,\n Orthopaedics, ENT, Urology, Neuro\n Surgery, Plastic Surgery and\n Pulmonology","2013-04-27"]
[null,23,"Anupama Hospital, 16-31/494 & 495, 6th\nPhase, KPHB Colony, JNTU Road,\nKukatpally, Hyderabad","2010-02-03","31250/LC-B/2009","Anaesthesiology, General Medicine,\n General Surgery, Cardiology, ENT,\n Emergency Medicine, OBG,\n Orthopaedics, Paediatrics, Pathology,\n Plastic Surgery, Pulmonology,\n Radiology, Surgical Gastroentesrology,\n Urology and Physiotherapy Unit","2013-02-02","Anupama Hospital, 16-31/494 & 495, 6th\nPhase, KPHB Colony, JNTU Road,\nKukatpally, Hyderabad","2010-02-03","31250/LC-B/2009","Anaesthesiology, General Medicine,\n General Surgery, Cardiology, ENT,\n Emergency Medicine, OBG,\n Orthopaedics, Paediatrics, Pathology,\n Plastic Surgery, Pulmonology,\n Radiology, Surgical Gastroentesrology,\n Urology and Physiotherapy Unit","2013-02-02"]
[null,24,"Aparna Hospitals Pvt. Ltd., 2-5-680,\nSubhedari, Hanumakonda, Warangal","12-Dec-2008","27035/LC.B/2008","E.N.T.","11-Dec-2011","Aparna Hospitals Pvt. Ltd., 2-5-680,\nSubhedari, Hanumakonda, Warangal","12-Dec-2008","27035/LC.B/2008","E.N.T.","11-Dec-2011"]
[null,25,"Apex Hosptials, 75-6-23, Prakash Nagar,\nRajahmundry, E.G. Dist.","9-Apr-2009","1996/LC.B/2007","General Surgery","8-Apr-2012","Apex Hosptials, 75-6-23, Prakash Nagar,\nRajahmundry, E.G. Dist.","9-Apr-2009","1996/LC.B/2007","General Surgery","8-Apr-2012"]
[null,26,"Apollo DRDO Hospital, DRML 'X' Road,\nKanchanbagh, Hyderabad","2007-02-20","3940/LC-B/2006","Anesthesiology, General Medicine,\n General Surgery, Cardiology, C.T.\n Surgery, Emergency Medicine, ENT,\n Surgical Gastroenterology,\n Nephrology, Neuro Surgery, OBG,\n Orthopedics, Pediatrics, Plastic\n Surgery, Pulmonology, Radiology,\n Urology, Physiotherapy and Dialysis","2013-02-19","Apollo DRDO Hospital, DRML 'X' Road,\nKanchanbagh, Hyderabad","2007-02-20","3940/LC-B/2006","Anesthesiology, General Medicine,\n General Surgery, Cardiology, C.T.\n Surgery, Emergency Medicine, ENT,\n Surgical Gastroenterology,\n Nephrology, Neuro Surgery, OBG,\n Orthopedics, Pediatrics, Plastic\n Surgery, Pulmonology, Radiology,\n Urology, Physiotherapy and Dialysis","2013-02-19"]
[null,27,"Apollo Hospital, Jublee Hills, Hyderabad","2006-07-22"," 3941/LC-B/2006","Anaesthesiology, Cardiology,\n C.T.Surgery, ENT, Emergency\n Medicine, General Medicine, General\n Surgery, Nephrology, Neuro Surgery,\n Nuclear Medicine, OBG, Orthopaedics,\n Paediatrics, Plastic Surgery,\n Pulmonology, Radiology, Pathology,\n Urology, Surgical Gastroenterology,\n Surgical Oncology, Physiotherapy and\n Dialysis Unit","2012-07-21","Apollo Hospital, Jublee Hills, Hyderabad","2006-07-22"," 3941/LC-B/2006","Anaesthesiology, Cardiology,\n C.T.Surgery, ENT, Emergency\n Medicine, General Medicine, General\n Surgery, Nephrology, Neuro Surgery,\n Nuclear Medicine, OBG, Orthopaedics,\n Paediatrics, Plastic Surgery,\n Pulmonology, Radiology, Pathology,\n Urology, Surgical Gastroenterology,\n Surgical Oncology, Physiotherapy and\n Dialysis Unit","2012-07-21"]
[null,28,"Apollo Hospital, Vikrampuri, Secunderabad.","2007-02-20","3937/LC-B/2006","Anesthesiology, Cardiology, ENT,\n Emergency Medicine, General\n Medicine, General Surgery,\n Nephrology, Nuclear Medicine, Obst &\n Gynecology, Orthopedics, Pediatrics,\n Pathology, Plastic Surgery,\n Pulmonology, Gastroentrology\n Radiology, Oncology and\n Physiotherapy","2010-02-19","Apollo Hospital, Vikrampuri, Secunderabad.","2007-02-20","3937/LC-B/2006","Anesthesiology, Cardiology, ENT,\n Emergency Medicine, General\n Medicine, General Surgery,\n Nephrology, Nuclear Medicine, Obst &\n Gynecology, Orthopedics, Pediatrics,\n Pathology, Plastic Surgery,\n Pulmonology, Gastroentrology\n Radiology, Oncology and\n Physiotherapy","2010-02-19"]
[null,29,"Apollo Hospital, Waltair Main Road,\nVisakhapatnam","2006-07-22","18541/LC-B/2005","Anaesthesiology, Cardiology,\n C.T.Surgery, ENT, Emergency\n Medicine, General Medsicine, General\n Surgery, Nephrology, Neuro Surgery,\n OBG, Orthopaedics, Paediatrics,\n Pathology, Plastic Surgery,\n Pulmonology, Radiology, Surgical\n Gastroenterology, Surgical Oncology\n and Dialysis","2012-07-21","Apollo Hospital, Waltair Main Road,\nVisakhapatnam","2006-07-22","18541/LC-B/2005","Anaesthesiology, Cardiology,\n C.T.Surgery, ENT, Emergency\n Medicine, General Medsicine, General\n Surgery, Nephrology, Neuro Surgery,\n OBG, Orthopaedics, Paediatrics,\n Pathology, Plastic Surgery,\n Pulmonology, Radiology, Surgical\n Gastroenterology, Surgical Oncology\n and Dialysis","2012-07-21"]
[null,30,"Apollo Hospitals, D.No. 13-1-13, Main Road,\nKakinada.","2006-09-12","10450/LC-B/2006","Anaesthesiology, Cardiology,\n C.T.Surgery, ENT, Emergency\n Medicine, General Medicine, General\n Surgesry, Nephrology, Neuro Surgery,\n Orthopaedics, Paediatrics, Pathology,\n Plastic Surgery, Pulmonology,\n Radiology, Surgical Gastroenterology,\n Susrgical Oncology, Urology,\n Physiotherapy and Dialysis","2012-09-11","Apollo Hospitals, D.No. 13-1-13, Main Road,\nKakinada.","2006-09-12","10450/LC-B/2006","Anaesthesiology, Cardiology,\n C.T.Surgery, ENT, Emergency\n Medicine, General Medicine, General\n Surgesry, Nephrology, Neuro Surgery,\n Orthopaedics, Paediatrics, Pathology,\n Plastic Surgery, Pulmonology,\n Radiology, Surgical Gastroenterology,\n Susrgical Oncology, Urology,\n Physiotherapy and Dialysis","2012-09-11"]
[null,31,"Apollo Nursing Home, 3-3-96, Civil Hospital\nRoad, Karimnagar.","2009-05-30","49078/LC.B/2008","Anesthesiology, Gen. Med. Gen.\n Surgery, OBG, Pediatrics, ENT,\n Orthopaedics, Surgical Oncology,\n Urology, Radiology, Pulmonology,\n Plastic Surgeryand Physiotherapy"," 29-May-2012","Apollo Nursing Home, 3-3-96, Civil Hospital\nRoad, Karimnagar.","2009-05-30","49078/LC.B/2008","Anesthesiology, Gen. Med. Gen.\n Surgery, OBG, Pediatrics, ENT,\n Orthopaedics, Surgical Oncology,\n Urology, Radiology, Pulmonology,\n Plastic Surgeryand Physiotherapy"," 29-May-2012"]
[null,32,"Apollo Reach Hospitals, Railway Station\nRoad, Karimnagar","2009-10-09","3541/LC-B/2009","Anaesthesiology, Cardiology,\n C.T.Surgery, Emergency Medicine,\n General Medicine, General Surgery,\n Nephrology, Neuro Surgery,\n Orthopaedics, Urology and\n Physiotherapy","2012-10-08","Apollo Reach Hospitals, Railway Station\nRoad, Karimnagar","2009-10-09","3541/LC-B/2009","Anaesthesiology, Cardiology,\n C.T.Surgery, Emergency Medicine,\n General Medicine, General Surgery,\n Nephrology, Neuro Surgery,\n Orthopaedics, Urology and\n Physiotherapy","2012-10-08"]
[null,33,"Apple Dental Care, Opp. Vijaya Talkies,\nShanmuka Complex, Eluru Road, Vijayawada","26-Mar-2010","30967/LC-B/2009","Dental","25-Mar-2013","Apple Dental Care, Opp. Vijaya Talkies,\nShanmuka Complex, Eluru Road, Vijayawada","26-Mar-2010","30967/LC-B/2009","Dental","25-Mar-2013"]
[null,34,"Aravind Eye Care Centre, 20/1100, Radha\nKrishna Nagar, Lane Opp. Ramesh Theatre,\nKadapa","24-Apr-2010","46774/LC-B/2009","Ophthalmology","23-Apr-2013","Aravind Eye Care Centre, 20/1100, Radha\nKrishna Nagar, Lane Opp. Ramesh Theatre,\nKadapa","24-Apr-2010","46774/LC-B/2009","Ophthalmology","23-Apr-2013"]
[null,35,"Aravind Eye Hospital and Lasic Center,\nSanthosh Nagar Colony, Mehadipatnam,\nHyderabad.","6-Nov-2007","1805/LC.B/2006","Ophthalmology","5-Nov-2010","Aravind Eye Hospital and Lasic Center,\nSanthosh Nagar Colony, Mehadipatnam,\nHyderabad.","6-Nov-2007","1805/LC.B/2006","Ophthalmology","5-Nov-2010"]
[null,36,"Aravind Kidney Centre, 15/402,Brindavanam,\nMain Road, Nellore.","2006-05-06","8202/LC.B/2005","General Medicine, Anaesthesiology,\n OBG, Urology and Nephrology","2012-05-05","Aravind Kidney Centre, 15/402,Brindavanam,\nMain Road, Nellore.","2006-05-06","8202/LC.B/2005","General Medicine, Anaesthesiology,\n OBG, Urology and Nephrology","2012-05-05"]
[null,37,"Aravind Nethralaya Meenakshi Diabetes and\nEndocrinology and Super Speciality Hospital,\nSwathantra Park Street, Gandhi Nagar,\nNellore","2006-04-26","14515/LC.B/2005","Ophthalmology","2012-04-25","Aravind Nethralaya Meenakshi Diabetes and\nEndocrinology and Super Speciality Hospital,\nSwathantra Park Street, Gandhi Nagar,\nNellore","2006-04-26","14515/LC.B/2005","Ophthalmology","2012-04-25"]
[null,38,"ARK Hospital, Kukatpally, Hyderabad.","6-May-2006","17515/LC.B/2005","Medical & General SurgeryObstetrics\n & Gynecology and Pediatrics","5-May-2009","ARK Hospital, Kukatpally, Hyderabad.","6-May-2006","17515/LC.B/2005","Medical & General SurgeryObstetrics\n & Gynecology and Pediatrics","5-May-2009"]
[null,39,"Arun Kidney Center, 29-23-9, Tadepallivari\nStreet, Suryaraopet, Vijayawada","28-Apr-2007","21930/LC-B/2006","Nephrology, Urology (Kidney\n transplantation)","27-Apr-2010","Arun Kidney Center, 29-23-9, Tadepallivari\nStreet, Suryaraopet, Vijayawada","28-Apr-2007","21930/LC-B/2006","Nephrology, Urology (Kidney\n transplantation)","27-Apr-2010"]
[null,40,"Aruna Hospital, Road No. 4, Chandrapuri\nColony, L.B. Nagar, Hyderabad.","23-Apr-2008","46405/LC.B/2007","Ophthalmology","22-Apr-2011","Aruna Hospital, Road No. 4, Chandrapuri\nColony, L.B. Nagar, Hyderabad.","23-Apr-2008","46405/LC.B/2007","Ophthalmology","22-Apr-2011"]
[null,41,"Asha Hospitals, 7/201, Court Road,\nAnantapur.","2005-11-16","18471/LC-B/2005","General Medicine, General Surgery,\n Orthopaedics and Urology","2011-11-15","Asha Hospitals, 7/201, Court Road,\nAnantapur.","2005-11-16","18471/LC-B/2005","General Medicine, General Surgery,\n Orthopaedics and Urology","2011-11-15"]
[null,42,"Ashok Super Speciality Dental & Orthodontic\nand Implantology Centre, Opp. K.K.Nursing\nHome, Civil Hospital Road, Karimnagar","2010-02-03","37113/LC-B/2009","Dental","2013-02-02","Ashok Super Speciality Dental & Orthodontic\nand Implantology Centre, Opp. K.K.Nursing\nHome, Civil Hospital Road, Karimnagar","2010-02-03","37113/LC-B/2009","Dental","2013-02-02"]
[null,43,"Ashwini SpecialtyDental Hospital, Humayun\nNagar, Hyderabad","22-May-2008","23737/LC.B/2006","Dental","21-May-2011","Ashwini SpecialtyDental Hospital, Humayun\nNagar, Hyderabad","22-May-2008","23737/LC.B/2006","Dental","21-May-2011"]
[null,44,"Asian Institute of Gastroenterology, 6-3-661,\nSomajiguda, Hyderabad","2006-02-03","7525/LC-B/2005","Medical Gastroenterological, Surgical\n Gastroenterological, Oncology,\n General Surgery, Anaesthesiology,\n Pathology, Radiology & Dialysis Unit.","2012-02-02","Asian Institute of Gastroenterology, 6-3-661,\nSomajiguda, Hyderabad","2006-02-03","7525/LC-B/2005","Medical Gastroenterological, Surgical\n Gastroenterological, Oncology,\n General Surgery, Anaesthesiology,\n Pathology, Radiology & Dialysis Unit.","2012-02-02"]
[null,45,"Aswini Dental Hospital, 143-A Block, Aditya\nEnclave, opp. Saradhi Studio, Ameerpet,\nHyderabad.","26-Apr-2007","16368/LC-B/2006","Dental","25-Apr-2010","Aswini Dental Hospital, 143-A Block, Aditya\nEnclave, opp. Saradhi Studio, Ameerpet,\nHyderabad.","26-Apr-2007","16368/LC-B/2006","Dental","25-Apr-2010"]
[null,46,"Aswini Hospital, Near RTC Bus Stand\nMangalagiri Road, Guntur","27-Jul-2007","30814/LC-B/2006","Urology, Nephrology","26-Jul-2010","Aswini Hospital, Near RTC Bus Stand\nMangalagiri Road, Guntur","27-Jul-2007","30814/LC-B/2006","Urology, Nephrology","26-Jul-2010"]
[null,47,"Aswini Netralayam, Guntur Road,\nNarsaraopeta, Guntur Dist.","11-Jun-2010","12269/LC-B/2010","Ophthalmology","10-Jun-2013","Aswini Netralayam, Guntur Road,\nNarsaraopeta, Guntur Dist.","11-Jun-2010","12269/LC-B/2010","Ophthalmology","10-Jun-2013"]
[null,48,"Aswini Super Specialty Dental Hospital, 29-13-\n84, Opp. Badri Heritage Apartments,\nKaleswararao Road, suryaraopet, Vijayawada","2010-01-22","26005/LC-B/2009","Dental","2013-01-21","Aswini Super Specialty Dental Hospital, 29-13-\n84, Opp. Badri Heritage Apartments,\nKaleswararao Road, suryaraopet, Vijayawada","2010-01-22","26005/LC-B/2009","Dental","2013-01-21"]
[null,49,"AVPR Super Specialtiy Dental Hl., 1-1-191,\nTahasil Chowrastha, Jagityal, Karimnagar\nDist.","1-Aug-2009","45725/LC-B/2008","Dental","31-Jul-2012","AVPR Super Specialtiy Dental Hl., 1-1-191,\nTahasil Chowrastha, Jagityal, Karimnagar\nDist.","1-Aug-2009","45725/LC-B/2008","Dental","31-Jul-2012"]
[null,50,"Aware Global Hospitals, 8-16-01, Sowbhagya\nNagar, Sagar Road, Lingoliguda,\nSaroornagar, Hyderabad.","24-Jul-2009","13385/LC-B/2009","Multi Spescialisation","23-Jul-2012","Aware Global Hospitals, 8-16-01, Sowbhagya\nNagar, Sagar Road, Lingoliguda,\nSaroornagar, Hyderabad.","24-Jul-2009","13385/LC-B/2009","Multi Spescialisation","23-Jul-2012"]
[null,51,"Axon Hospitals, 8-3-215. Srinivasanagar\nColony West, Opp. ICICI Bank, S.R.Nagar,\nHyderabad","2009-10-09","24364/LC-B/2009","Anaesthesiology, Cardiology,\n C.T.Surgery, General Medicine,\n General Surgery, Neuro Surgery, OBG,\n Orthopaedics, Urology, Physiotherapy\n and Dialysis Unit","2012-10-08","Axon Hospitals, 8-3-215. Srinivasanagar\nColony West, Opp. ICICI Bank, S.R.Nagar,\nHyderabad","2009-10-09","24364/LC-B/2009","Anaesthesiology, Cardiology,\n C.T.Surgery, General Medicine,\n General Surgery, Neuro Surgery, OBG,\n Orthopaedics, Urology, Physiotherapy\n and Dialysis Unit","2012-10-08"]
[null,52,"Baba Dental Clinic, 2nd Floor, Mediworld, 14-\n37-39, Maharanipet, Visakhapatnam","22-Jul-2006","20302/LC-B/2005","Dental","21-Jul-2009","Baba Dental Clinic, 2nd Floor, Mediworld, 14-\n37-39, Maharanipet, Visakhapatnam","22-Jul-2006","20302/LC-B/2005","Dental","21-Jul-2009"]
[null,53,"Balaji Cancer Center, Gowri Shankar Theatre\nRoad, Kothapet, Guntur.","13-Sep-2007","2886/LC.B/2005","Cancer","12-Sep-2010","Balaji Cancer Center, Gowri Shankar Theatre\nRoad, Kothapet, Guntur.","13-Sep-2007","2886/LC.B/2005","Cancer","12-Sep-2010"]
[null,54,"Balaji Dental Hospital,11-231 , Opp:Girls Jr.\nCollege, Sai Nagar, Ananthapur.","13-May-2009","6215/LC.B/2009","Dental","12-May-2012","Balaji Dental Hospital,11-231 , Opp:Girls Jr.\nCollege, Sai Nagar, Ananthapur.","13-May-2009","6215/LC.B/2009","Dental","12-May-2012"]
[null,55,"Balaji Eye Care & Laser Centre, 1st Floor, 6-3-\n788/32, Durga Nagar Colony, Opp. Chandana\nBros. Ameerpet, Hyderabad","1-Aug-2009","38914/LC-B/2008","Ophthalmology","31-Jul-2012","Balaji Eye Care & Laser Centre, 1st Floor, 6-3-\n788/32, Durga Nagar Colony, Opp. Chandana\nBros. Ameerpet, Hyderabad","1-Aug-2009","38914/LC-B/2008","Ophthalmology","31-Jul-2012"]
[null,56,"Balaji Hospital, Opp. Ram Laxman Theater,\nS.V.N. Road, Warangal","20-Jun-2008","6138/LC.B/2008","Orthopedics","19-Jun-2011","Balaji Hospital, Opp. Ram Laxman Theater,\nS.V.N. Road, Warangal","20-Jun-2008","6138/LC.B/2008","Orthopedics","19-Jun-2011"]
[null,57,"Balaji Hospital, Plot No. 34,34/A, N.C.L.\nSouth, Pet Basheerabad, Medchal Road,\nSecunderabad.","2008-04-25","3156/LC.B/2007","Genl. Medicine, Genl. Surgery,\n Emergency Medicine, Orthopedics,\n Pediatrics, OBG., Pulmanology,\n Cardiology, Urology, Neurology, Neuro\n Surgery, E.N.T., Gastroenterology,\n Surgical Gastroenterology, Plastic\n Surgery, Physiotherapy, Surgical\n Oncology","2011-04-24","Balaji Hospital, Plot No. 34,34/A, N.C.L.\nSouth, Pet Basheerabad, Medchal Road,\nSecunderabad.","2008-04-25","3156/LC.B/2007","Genl. Medicine, Genl. Surgery,\n Emergency Medicine, Orthopedics,\n Pediatrics, OBG., Pulmanology,\n Cardiology, Urology, Neurology, Neuro\n Surgery, E.N.T., Gastroenterology,\n Surgical Gastroenterology, Plastic\n Surgery, Physiotherapy, Surgical\n Oncology","2011-04-24"]
[null,58,"Balaji Multi Speciality Hospital, Near RTC Bus\nStand Circle, Madanapalli, Chittoor District.","7-Aug-2010","24294/LC-B/2010","General Medicine, General Surgery,\n ENT, OBG, Paediatrics and\n Orthopaedics","6-Aug-2013","Balaji Multi Speciality Hospital, Near RTC Bus\nStand Circle, Madanapalli, Chittoor District.","7-Aug-2010","24294/LC-B/2010","General Medicine, General Surgery,\n ENT, OBG, Paediatrics and\n Orthopaedics","6-Aug-2013"]
[null,59,"Balaji Orthopaedic & Trauma Hospital, 13-7-\n939/4, Tuda Office Road, Tirupathi","30-Sep-2009","24745/LC-b/2009","Orthopaedics & Traumatology","29-Sept-2012","Balaji Orthopaedic & Trauma Hospital, 13-7-\n939/4, Tuda Office Road, Tirupathi","30-Sep-2009","24745/LC-b/2009","Orthopaedics & Traumatology","29-Sept-2012"]
[null,60,"Bharat Dental Care Multi Speciality Dental\nHospital, Theatre Road, Tuni, E.G.Dist.","27-Mar-2010","41259/LC-B/2009","Dental","26-Mar-2013","Bharat Dental Care Multi Speciality Dental\nHospital, Theatre Road, Tuni, E.G.Dist.","27-Mar-2010","41259/LC-B/2009","Dental","26-Mar-2013"]
[null,61,"Bharathi Hospitals, Gandhi Nagar, R.S. Road,\nY.M. Palli, Kadapa.","16-Dec-2008","23336/LC.B/2007","Ophthalmology","15-Dec-2011","Bharathi Hospitals, Gandhi Nagar, R.S. Road,\nY.M. Palli, Kadapa.","16-Dec-2008","23336/LC.B/2007","Ophthalmology","15-Dec-2011"]
[null,62,"Bhavya Multi Speciality Hospital, Plot NO.65,\nRoad No.5, New Samathapuri Colony, Nagole\nX Roads, Hyderabad","3-Jul-2010","42403/LC-B/2009","Ophthalmology ( for Anterior Segment\n diseases only)","2-Jul-2013","Bhavya Multi Speciality Hospital, Plot NO.65,\nRoad No.5, New Samathapuri Colony, Nagole\nX Roads, Hyderabad","3-Jul-2010","42403/LC-B/2009","Ophthalmology ( for Anterior Segment\n diseases only)","2-Jul-2013"]
[null,63,"Bhimavaram Hospital, J.P. Road,\nBhimavaram.","2005-10-24","7144/LC-B/2005","Anaesthesiology, General Medicine,\n General Surgery, Cardiology, ENT,\n Nephrology, Neuro Surgery, OBG,\n Orthopaedics, Paediatrics, Pathology,\n Radiology, Surgical Gastroenterology,\n Urology, Physiotherapy and Dialysis\n Unit","2011-10-23","Bhimavaram Hospital, J.P. Road,\nBhimavaram.","2005-10-24","7144/LC-B/2005","Anaesthesiology, General Medicine,\n General Surgery, Cardiology, ENT,\n Nephrology, Neuro Surgery, OBG,\n Orthopaedics, Paediatrics, Pathology,\n Radiology, Surgical Gastroenterology,\n Urology, Physiotherapy and Dialysis\n Unit","2011-10-23"]
[null,64,"Bhuma Super Speciality Dental Hospital,\n21/604, Opp. Masjid, 7 Roads Circle, Kadapa","30-Jul-2010","14597/LC-B/2010","Dental","29-Jul-2013","Bhuma Super Speciality Dental Hospital,\n21/604, Opp. Masjid, 7 Roads Circle, Kadapa","30-Jul-2010","14597/LC-B/2010","Dental","29-Jul-2013"]
[null,65,"Bollineni Eye Hospital and Research Center,\nDargametta, Nellore.",{"$f":"I67","v":"10-Aug-2007"},{"$f":"J67","v":"7789/LC.B/2007"},{"$f":"K67","v":"Ophthalmology"},{"$f":"L67","v":"9-Aug-2010"},"Bollineni Eye Hospital and Research Center,\nDargametta, Nellore.","10-Aug-2007","7789/LC.B/2007","Ophthalmology","9-Aug-2010"]
[null,66,"Bollineni Heart Centre Pvt. Ltd. 77-9-37/1,\nSeelam Nookaraju Complex Street,\nRajhmundry, E.G.Dist.","12-Mar-2010","28621/LC-B/2009","Cardiology, C.T.Surgery, Orthopaedics,\n Urology and Nephrology","11-Mar-2013","Bollineni Heart Centre Pvt. Ltd. 77-9-37/1,\nSeelam Nookaraju Complex Street,\nRajhmundry, E.G.Dist.","12-Mar-2010","28621/LC-B/2009","Cardiology, C.T.Surgery, Orthopaedics,\n Urology and Nephrology","11-Mar-2013"]
[null,67,"Bollineni Heart Centre, 46-7-47, Danavaipet,\nRajhmundry.","11-Sep-2006","10025/LC-B/2003","Cardiac","10-Sep-2009","Bollineni Heart Centre, 46-7-47, Danavaipet,\nRajhmundry.","11-Sep-2006","10025/LC-B/2003","Cardiac","10-Sep-2009"]
[null,68,"Bollineni Ramanaiah Memorial Hospital Pvt.\nLtd., (Dental Department) Ambuja Centre,\nDurgamitta, Nellore.","6-Nov-2007","7791/LC.B/2007","Dental","5-Nov-2010","Bollineni Ramanaiah Memorial Hospital Pvt.\nLtd., (Dental Department) Ambuja Centre,\nDurgamitta, Nellore.","6-Nov-2007","7791/LC.B/2007","Dental","5-Nov-2010"]
[null,69,"Bollineni Ramanaiah Memorial Hospital,\nAmbuja Centre, Durgamitta, Nellore.","2006-10-16","18530/LC-B/2005","Cardiology, C.T.Surgery, ENT, General Medicine, General Surgery,Nephrology, Neuro Surgery, OBG,Orthopaedics, Paediatrics, Plastic Surgery, Pulmonology, Radiology, Surgical Gastroenterology, Surgical\n Oncology and Urology","2012-10-15","Bollineni Ramanaiah Memorial Hospital,\nAmbuja Centre, Durgamitta, Nellore.","2006-10-16","18530/LC-B/2005","Cardiology, C.T.Surgery, ENT, General Medicine, General Surgery,Nephrology, Neuro Surgery, OBG,Orthopaedics, Paediatrics, Plastic Surgery, Pulmonology, Radiology, Surgical Gastroenterology, Surgical\n Oncology and Urology","2012-10-15"]
[null,70,"Bombay Nursing Home, Hyderabad Road,\nNizamabad.","17-Apr-2008","18575/LC.B/2006","Genl. Surgery, Urology, E.N.T.,\n Orthopedics and Neuro Surgery.","16-Apr-2011","Bombay Nursing Home, Hyderabad Road,\nNizamabad.","17-Apr-2008","18575/LC.B/2006","Genl. Surgery, Urology, E.N.T.,\n Orthopedics and Neuro Surgery.","16-Apr-2011"]
[null,71,"C.C. Shoroff Memorial Hospital, Barkatpura,\nHyderabad","2008-05-22","7057/LC.B/2005","General Medicine, General Surgery,\n Anaesthesiology, E.N.T. Emergency\n Medicine, Nephrology, Neuro Surgery,\n O.B.G., Orthopedics, Pediatrics,\n Pathology, Plastic Surgery, Radiology,\n Surgical Gastroenterology, Surgical\n Oncology, Urology, Physiotherapy and\n Dialysis","2011-05-21","C.C. Shoroff Memorial Hospital, Barkatpura,\nHyderabad","2008-05-22","7057/LC.B/2005","General Medicine, General Surgery,\n Anaesthesiology, E.N.T. Emergency\n Medicine, Nephrology, Neuro Surgery,\n O.B.G., Orthopedics, Pediatrics,\n Pathology, Plastic Surgery, Radiology,\n Surgical Gastroenterology, Surgical\n Oncology, Urology, Physiotherapy and\n Dialysis","2011-05-21"]
[null,72,"C.N. Hospitals, Birla Compound, B-Camp,\nkurnool.","2008-04-17","25264/LC.B/2007","Genl. Medicine, Genl. Surgery,\n Anaesthesiology, E.N.T., Emergency\n Medicine, Cardiology, Laproscopic\n Surgery, OBG., Pediatrics,\n Orthopedics, Plastic Surgery,\n Pulmanology, Radiology, Surgical\n Gastroenterology, Urology, Neuro\n Surgery, and Physiotherapy,.","2011-04-16","C.N. Hospitals, Birla Compound, B-Camp,\nkurnool.","2008-04-17","25264/LC.B/2007","Genl. Medicine, Genl. Surgery,\n Anaesthesiology, E.N.T., Emergency\n Medicine, Cardiology, Laproscopic\n Surgery, OBG., Pediatrics,\n Orthopedics, Plastic Surgery,\n Pulmanology, Radiology, Surgical\n Gastroenterology, Urology, Neuro\n Surgery, and Physiotherapy,.","2011-04-16"]
[null,73,"C.S. Reddy Super, Speciality Dental Hospital,\n3/271 Dr. Prabhakar Rao, Hospital Complex,\nChristial Lane , Kadapa.","7-Jul-2009","6112/LC-B/2009","Dental","6-Jul-2012","C.S. Reddy Super, Speciality Dental Hospital,\n3/271 Dr. Prabhakar Rao, Hospital Complex,\nChristial Lane , Kadapa.","7-Jul-2009","6112/LC-B/2009","Dental","6-Jul-2012"]
[null,74,"Care Dental Specialities Hospital, 40/353-C,\nGandhi Nagar, Kurnool","30-Jul-2010","6153/LC-B/2010","Dental","29-Jul-2013","Care Dental Specialities Hospital, 40/353-C,\nGandhi Nagar, Kurnool","30-Jul-2010","6153/LC-B/2010","Dental","29-Jul-2013"]
[null,75,"Care Hospital (A unit of Quality care India Ltd),\nBanjara Hills, Hyderabad.","2006-01-03","17353/LC-B/2005","Multi","2012-01-02","Care Hospital (A unit of Quality care India Ltd),\nBanjara Hills, Hyderabad.","2006-01-03","17353/LC-B/2005","Multi","2012-01-02"]
[null,76,"Care Hospital (Quality Care Inida Limited)\nExhibition Road, Nampally, Hyderabad.","2006-02-23","25630/LC-B/2005","Multi","2012-02-22","Care Hospital (Quality Care Inida Limited)\nExhibition Road, Nampally, Hyderabad.","2006-02-23","25630/LC-B/2005","Multi","2012-02-22"]
[null,77,"Care Hospital, Waltair Main Road,\nVisakhapatnam","2006-05-06","6808/LC.B/2006","Anaesthesiology, General Medicine,\n General Surgery, Cardiology,\n Orthopaedics, C.T.Surgery, ENT,\n Emergency Medicine, Nephrology,\n Neuro Surgery, OBG, Paediatrics,\n Pathology, Plastic Surgery,\n Pulmolology, Radiology, Surgical\n Gastroenterology, Oncology and\n Dialysis Unit","2012-05-05","Care Hospital, Waltair Main Road,\nVisakhapatnam","2006-05-06","6808/LC.B/2006","Anaesthesiology, General Medicine,\n General Surgery, Cardiology,\n Orthopaedics, C.T.Surgery, ENT,\n Emergency Medicine, Nephrology,\n Neuro Surgery, OBG, Paediatrics,\n Pathology, Plastic Surgery,\n Pulmolology, Radiology, Surgical\n Gastroenterology, Oncology and\n Dialysis Unit","2012-05-05"]
[null,78,"Care Super Specialty Dental Hospital Pvt. Ltd,\nJuvvalapalem Road, Bhimavaram.","20-Mar-2009","20461/LC.B.2008","Dental","19-Mar-2012","Care Super Specialty Dental Hospital Pvt. Ltd,\nJuvvalapalem Road, Bhimavaram.","20-Mar-2009","20461/LC.B.2008","Dental","19-Mar-2012"]
[null,79,"Care Super Specialty Hospital, 16-11/72,\nPogathota, Nellore.","8-Sep-2008","20552/LC.B/2007","Dental","7-Sep-2011","Care Super Specialty Hospital, 16-11/72,\nPogathota, Nellore.","8-Sep-2008","20552/LC.B/2007","Dental","7-Sep-2011"]
[null,80,"Chaitanya Dental Hospital, 1-1-230/33 Jyothi\nBhavan, Chikkadpally, Hyderabad.","11-May-2007","16635/LC.B/2006","Dental","10-May-2010","Chaitanya Dental Hospital, 1-1-230/33 Jyothi\nBhavan, Chikkadpally, Hyderabad.","11-May-2007","16635/LC.B/2006","Dental","10-May-2010"]
[null,81,"Chaitanya Eye Hospital, Tikkili Road, Near\nSiddhartha Arts College, Mogalrajpuram,\nVijayawada.","15-Sep-2008","28736/LC.B/2006","Opthalomology","14-Sep-2011","Chaitanya Eye Hospital, Tikkili Road, Near\nSiddhartha Arts College, Mogalrajpuram,\nVijayawada.","15-Sep-2008","28736/LC.B/2006","Opthalomology","14-Sep-2011"]
[null,82,"Chaitanya Hospital, Near By-Pass, Anjaiah\nRoad, Ongole, Prakasam Dist.","30-Jul-2010","5816/LC-B/2010","General Medicine, General Surgery,\n Anaesthesiology, OBG, Orthopaedics\n and Paediatrics","29-Jul-2013","Chaitanya Hospital, Near By-Pass, Anjaiah\nRoad, Ongole, Prakasam Dist.","30-Jul-2010","5816/LC-B/2010","General Medicine, General Surgery,\n Anaesthesiology, OBG, Orthopaedics\n and Paediatrics","29-Jul-2013"]
[null,83,"Challa Eye Care Centre, Plot No. 8-2-268/R/9-\nP, Sagar Society Main Road, Road No.2,\nBanjara Hills, Hyderabad","2-Jul-2010","46229/LC-B/2009","Ophthalmology ( for Anterior Segment\n diseases only )","1-Jul-2013","Challa Eye Care Centre, Plot No. 8-2-268/R/9-\nP, Sagar Society Main Road, Road No.2,\nBanjara Hills, Hyderabad","2-Jul-2010","46229/LC-B/2009","Ophthalmology ( for Anterior Segment\n diseases only )","1-Jul-2013"]
[null,84,"Challa Hospital, 7-1-71/A/1, Dharam Karan\nRoad, Ameerpet, Hyderabad.","2007-01-06","1806/LC-B/2006","Anesthesiology, Cardiology, ENT,\n General Medicine, General Surgery,\n Nephrology, Neuro Surgery, Plastic\n Surgery, Obstt & Gynecology,\n Orthopaedics, Pediatrics, Urology,\n Emergency Medicine, Pathology,\n Pulmonology, Radiology and Oncology","2010-01-05","Challa Hospital, 7-1-71/A/1, Dharam Karan\nRoad, Ameerpet, Hyderabad.","2007-01-06","1806/LC-B/2006","Anesthesiology, Cardiology, ENT,\n General Medicine, General Surgery,\n Nephrology, Neuro Surgery, Plastic\n Surgery, Obstt & Gynecology,\n Orthopaedics, Pediatrics, Urology,\n Emergency Medicine, Pathology,\n Pulmonology, Radiology and Oncology","2010-01-05"]
[null,85,"Chandamama Children's Hospital, Sundaraiah\nBhavan Road, Ongole, Prakasam Dist.","16-Apr-2010","43601/LC-B/2009","Paediatrics","2013-04-15","Chandamama Children's Hospital, Sundaraiah\nBhavan Road, Ongole, Prakasam Dist.","16-Apr-2010","43601/LC-B/2009","Paediatrics","2013-04-15"]
[null,86,"Charitasri Hospitals Ltd., 29-6-8/1,\nRamachandra Rao Road, Suryaraopet,\nVijayawada - 520002.","2006-11-10","8806/LC-B/2006","Anaesthesiology, General Medicine,\n General Surgery, ENT, Emergency\n Medicine, Cardiology, OBG,\n Nephrology, Neuro Surgery,\n Orthopaedics, Paediatrics, Pathology,\n Plastic Surgery, Pulmonology,\n Radiology, Surgical Gastroenterology,\n Surgical Oncology, Urology,\n PHysiotherapy and Dialysis","2012-11-09","Charitasri Hospitals Ltd., 29-6-8/1,\nRamachandra Rao Road, Suryaraopet,\nVijayawada - 520002.","2006-11-10","8806/LC-B/2006","Anaesthesiology, General Medicine,\n General Surgery, ENT, Emergency\n Medicine, Cardiology, OBG,\n Nephrology, Neuro Surgery,\n Orthopaedics, Paediatrics, Pathology,\n Plastic Surgery, Pulmonology,\n Radiology, Surgical Gastroenterology,\n Surgical Oncology, Urology,\n PHysiotherapy and Dialysis","2012-11-09"]
[null,87,"Chelmada Ananda Rao Institute of Medical\nSciences, Karimnagar","2008-08-14","10750/LC.B/2005","Genl. Medicine, Genl. Surgery,\n Anaesthesiology, Neuro Surgery,\n Orthopedics, Pulmanology, Physio\n Therapy, Pediatrics,.ENT., and OBG.","2011-08-13","Chelmada Ananda Rao Institute of Medical\nSciences, Karimnagar","2008-08-14","10750/LC.B/2005","Genl. Medicine, Genl. Surgery,\n Anaesthesiology, Neuro Surgery,\n Orthopedics, Pulmanology, Physio\n Therapy, Pediatrics,.ENT., and OBG.","2011-08-13"]
[null,88,"Citi Orthopaedic Centre, H.No. 32-6-18A,\nSikha Mani Centre, Prajasaktinagar,\nVijayawada","08-Dec-2009","35503/LC-B/2009","Orthopaedics & Trauma Care","07-Dec-2012","Citi Orthopaedic Centre, H.No. 32-6-18A,\nSikha Mani Centre, Prajasaktinagar,\nVijayawada","08-Dec-2009","35503/LC-B/2009","Orthopaedics & Trauma Care","07-Dec-2012"]
[null,89,"City Cancer Center, 33-25-33, Ch. Venkata\nKrishnaiah Street, Suryaraopet, Vijayawada.","13-Sep-2007","13647/LC.B/2006","Cancer","12-Sep-2010","City Cancer Center, 33-25-33, Ch. Venkata\nKrishnaiah Street, Suryaraopet, Vijayawada.","13-Sep-2007","13647/LC.B/2006","Cancer","12-Sep-2010"]
[null,90,"City Super Speciality Dental Hospital, Shobha\nPavani Complex, 1 st Floor, Vidya Nagar,\nHyderabad.","2006-09-11","14464/LC-B/2006","Dental","2012-09-10","City Super Speciality Dental Hospital, Shobha\nPavani Complex, 1 st Floor, Vidya Nagar,\nHyderabad.","2006-09-11","14464/LC-B/2006","Dental","2012-09-10"]
[null,91,"Clear Vision Eye Hospital, 3-6-272, Opp.\nTelugu Academy, Himayatnagar, Hyd.","17-Apr-2008","11154/LC.B/2006","Ophthalmology","16-Apr-2011","Clear Vision Eye Hospital, 3-6-272, Opp.\nTelugu Academy, Himayatnagar, Hyd.","17-Apr-2008","11154/LC.B/2006","Ophthalmology","16-Apr-2011"]
[null,92,"Curie City Cancer Hospital, Padavalarevu,\nGunadala, Vijayawada","22-Jan-2010","36997/LC-B/2009","Cancer","21-Jan-2013","Curie City Cancer Hospital, Padavalarevu,\nGunadala, Vijayawada","22-Jan-2010","36997/LC-B/2009","Cancer","21-Jan-2013"]
[null,93,"D.B.R. & S.K. Super Specilaity Hospital, 18-1-\n505, Mask Road, Opp: V.V.Mahal, Tirupathi","25-May-2009","36385/LC.B/2006","Gen. Med. Gen. Surgery, Surgical\n Gastroenterology, Nephrology and\n OBG","24-May-2012","D.B.R. & S.K. Super Specilaity Hospital, 18-1-\n505, Mask Road, Opp: V.V.Mahal, Tirupathi","25-May-2009","36385/LC.B/2006","Gen. Med. Gen. Surgery, Surgical\n Gastroenterology, Nephrology and\n OBG","24-May-2012"]
[null,94,"D.B.R. Dental Hospital, H. No. 6-2-122/1,\nBehind Z.P. Khammam.","23-Apr-2008","36519/LC.B/2007","Dental","22-Apr-2011","D.B.R. Dental Hospital, H. No. 6-2-122/1,\nBehind Z.P. Khammam.","23-Apr-2008","36519/LC.B/2007","Dental","22-Apr-2011"]
[null,95,"D.V.Raju Eye Hospital, P.R.College Road,\nKakinada, East Godavary Dist.","11-Jun-2010","4826/LC-B/2010","Ophthalmology","10-Jun-2013","D.V.Raju Eye Hospital, P.R.College Road,\nKakinada, East Godavary Dist.","11-Jun-2010","4826/LC-B/2010","Ophthalmology","10-Jun-2013"]
[null,96,"Dental Venue Multi Speciality Hospital, F-14,\nFirst Floor, Deepthi Apartments, S.P. Road,\nSecunderabad.","22-Jul-2006","7302/LC-B/2005","Dental","21-Jul-2009","Dental Venue Multi Speciality Hospital, F-14,\nFirst Floor, Deepthi Apartments, S.P. Road,\nSecunderabad.","22-Jul-2006","7302/LC-B/2005","Dental","21-Jul-2009"]
[null,97,"Dentnova Denal Hospital, 1st floor, Taj\nComplex, Nampally, Hyderabad.","2-May-2009","21360/LC.B/2006","Dental","1-May-2012","Dentnova Denal Hospital, 1st floor, Taj\nComplex, Nampally, Hyderabad.","2-May-2009","21360/LC.B/2006","Dental","1-May-2012"]
[null,98,"Dentocare Super speciailty Dental Hospital,\n12-2-962, Opp: Baby Hospital, 2nd cross, Sai\nNagar, Ananthapur.","25-May-2009","447/LC.B/2009","Dental","24-May-2012","Dentocare Super speciailty Dental Hospital,\n12-2-962, Opp: Baby Hospital, 2nd cross, Sai\nNagar, Ananthapur.","25-May-2009","447/LC.B/2009","Dental","24-May-2012"]
[null,99,"Denty's (A unit of Today's Health Care India\nPvt. Ltd.) 60-1-7/1, Siddhartha Nagar,\nVijayawada","29-Jul-2010","1763/LC-B/2010","Dental","28-Jul-2013","Denty's (A unit of Today's Health Care India\nPvt. Ltd.) 60-1-7/1, Siddhartha Nagar,\nVijayawada","29-Jul-2010","1763/LC-B/2010","Dental","28-Jul-2013"]
[null,100,"Devishetty Super Speciality Hospital, Civil\nHospital Road, Karimnagar","24-Oct-2009","10873/LC-B/2008","General Medicine, General Surgery,\n Orthopaedics, Paediatrics, ENT, Neuro\n Surgery and Pulmonology","23-Oct-2012","Devishetty Super Speciality Hospital, Civil\nHospital Road, Karimnagar","24-Oct-2009","10873/LC-B/2008","General Medicine, General Surgery,\n Orthopaedics, Paediatrics, ENT, Neuro\n Surgery and Pulmonology","23-Oct-2012"]
[null,101,"Diacon Diabetes Specialty Centre &\nDiagnostics, VV's Vintage Boulavard, 1st\nFloor, H.No. 6-3-1093, Rajbhavan Road,\nSomajiguda, Hyderabad.","2006-12-29","1801/LC-B/2006","Diabetes","2009-12-28","Diacon Diabetes Specialty Centre &\nDiagnostics, VV's Vintage Boulavard, 1st\nFloor, H.No. 6-3-1093, Rajbhavan Road,\nSomajiguda, Hyderabad.","2006-12-29","1801/LC-B/2006","Diabetes","2009-12-28"]
[null,102,"Dilsuknagar Super Speciality Dental Hospital,\nSirigiri Complex, Dilsulknagar, Hyderabad.","2007-05-11","22432/LC.B/2006","Dental","2013-05-10","Dilsuknagar Super Speciality Dental Hospital,\nSirigiri Complex, Dilsulknagar, Hyderabad.","2007-05-11","22432/LC.B/2006","Dental","2013-05-10"]
[null,103,"DNR Advanced Dental Hospital, 16-2-149,\nPogathota, Nellore","1-Aug-2009","10163/LC-B/2008","Dental","31-Jul-2012","DNR Advanced Dental Hospital, 16-2-149,\nPogathota, Nellore","1-Aug-2009","10163/LC-B/2008","Dental","31-Jul-2012"]
[null,104,"Dr. Akbar Eye Hospital and Laser Center, 12-\n3-234, 6th Lane, Srinagar, Ananthapur","12-Dec-2008","17658/LC.B/2007","Ophthalmology","11-Dec-2011","Dr. Akbar Eye Hospital and Laser Center, 12-\n3-234, 6th Lane, Srinagar, Ananthapur","12-Dec-2008","17658/LC.B/2007","Ophthalmology","11-Dec-2011"]
[null,105,"Dr. Anji Reddy Multi Specialty Hospital Pvt.\nLtd., 16-687, Main Road, Piduguralla, Guntur.","2008-11-14","36349/LC.B/2008","Genl. Medicine, Genl. Surgery, OBG.,\n Orthopedics, Gastro Enterology,\n Surgical Gastroentorology.","2011-11-13","Dr. Anji Reddy Multi Specialty Hospital Pvt.\nLtd., 16-687, Main Road, Piduguralla, Guntur.","2008-11-14","36349/LC.B/2008","Genl. Medicine, Genl. Surgery, OBG.,\n Orthopedics, Gastro Enterology,\n Surgical Gastroentorology.","2011-11-13"]
[null,106,"Dr. Gowds Dental Hospitals, #19, Durga\nEnclave, Road No.12, Banjara Hills,\nHyderabad","2006-05-06","19509/LC.B/2005","Dental","2012-05-05","Dr. Gowds Dental Hospitals, #19, Durga\nEnclave, Road No.12, Banjara Hills,\nHyderabad","2006-05-06","19509/LC.B/2005","Dental","2012-05-05"]
[null,107,"Dr. J.S.R. Dental Health Speciality, 1-128,\nSurya Towers, Bhavani Nagar, Malkajgiri,\nHyderabad.","2006-09-11","14467/LC-B/2006","Dental","2012-09-10","Dr. J.S.R. Dental Health Speciality, 1-128,\nSurya Towers, Bhavani Nagar, Malkajgiri,\nHyderabad.","2006-09-11","14467/LC-B/2006","Dental","2012-09-10"]
[null,108,"Dr. Konda Reddy Dental Hospital, 16/749,\nShankara Agraharam, Nellore.","8-Sep-2008","18657/LC.B/2007","Dental","8-Sep-2011","Dr. Konda Reddy Dental Hospital, 16/749,\nShankara Agraharam, Nellore.","8-Sep-2008","18657/LC.B/2007","Dental","8-Sep-2011"]
[null,109,"Dr. Kotareddy Hospital, Main Road, Kandukur,\nPrakasam Dist.","23-Dec-2009","33987/LC-B/2006","General Medicine, General Surgery,\n OBG and Orthopaedics","22-Dec-2012","Dr. Kotareddy Hospital, Main Road, Kandukur,\nPrakasam Dist.","23-Dec-2009","33987/LC-B/2006","General Medicine, General Surgery,\n OBG and Orthopaedics","22-Dec-2012"]
[null,110,"Dr. Lakshman's Institute of Orthopedics,\nC.V.R.N. Road, Karimnagar.","2009-03-21","13336/LC.B/2007","Orthopedics, Surgical Gastro\n Enterology, Plastic Surgery, OBG.,\n Urology, Neuro Surgery, Genl. Surgery\n and Anaesthesiology.","2012-03-20","Dr. Lakshman's Institute of Orthopedics,\nC.V.R.N. Road, Karimnagar.","2009-03-21","13336/LC.B/2007","Orthopedics, Surgical Gastro\n Enterology, Plastic Surgery, OBG.,\n Urology, Neuro Surgery, Genl. Surgery\n and Anaesthesiology.","2012-03-20"]
[null,111,"Dr. Malik Speciality Dental Cosmotic &\nSurgery Centre, R.P.Road, Secunderabad","22-Jan-2010","26201/LC-B/2009","Dental","21-Jan-2013","Dr. Malik Speciality Dental Cosmotic &\nSurgery Centre, R.P.Road, Secunderabad","22-Jan-2010","26201/LC-B/2009","Dental","21-Jan-2013"]
[null,112,"Dr. PJR Super Speciality Dental Hospital, 8-3-\n318/6B/7, Engineers Colony, Yousufguda\nMain Road, Hyderabad","29-Jul-2010","49039/LC-B/2010","Dental","28-Jul-2013","Dr. PJR Super Speciality Dental Hospital, 8-3-\n318/6B/7, Engineers Colony, Yousufguda\nMain Road, Hyderabad","29-Jul-2010","49039/LC-B/2010","Dental","28-Jul-2013"]
[null,113,"Dr. Prasad's Multi Specialty Dental Hospital,\nBanjara Hills, Hyderabad.","17-Apr-2008","2838/LC.B/2006","Dental","16-Apr-2011","Dr. Prasad's Multi Specialty Dental Hospital,\nBanjara Hills, Hyderabad.","17-Apr-2008","2838/LC.B/2006","Dental","16-Apr-2011"]
[null,114,"Dr. Ramayya's Urology, Nephrology Institute &\nHospital Pvt. Ltd. Adg. New MLA Quarters,\nBasheerbagh, Hyderabad.","24-Jul-2009","10429/LC-B/2009","Multi Spescialisation","23-Jul-2012","Dr. Ramayya's Urology, Nephrology Institute &\nHospital Pvt. Ltd. Adg. New MLA Quarters,\nBasheerbagh, Hyderabad.","24-Jul-2009","10429/LC-B/2009","Multi Spescialisation","23-Jul-2012"]
[null,115,"Dr. Sridhar International Dental Hospital &\nResearch Center, Eluru Road, Vijayawada.","2006-09-24","25802/LC-B/2003","Dental","2012-09-23","Dr. Sridhar International Dental Hospital &\nResearch Center, Eluru Road, Vijayawada.","2006-09-24","25802/LC-B/2003","Dental","2012-09-23"]
[null,116,"Dr. Vivekananda Reddy's Dental Hospital\nMulti Specialty and Inplant Center,\nDilsukhnagar, Hyderabad.","18-Apr-2008","23977/LC.B/2007","Dental","17-Apr-2011","Dr. Vivekananda Reddy's Dental Hospital\nMulti Specialty and Inplant Center,\nDilsukhnagar, Hyderabad.","18-Apr-2008","23977/LC.B/2007","Dental","17-Apr-2011"]
[null,117,"Dr.Bhoom Reddy's Hospital, Civil Hospital\nRaod, Karimnagar.","2008-12-16","2509/LC.B/2008","Genl. Medicine,Genl. Surgery, OBG.,\n Anaesthesiology, Orthopedics, Neuro\n Surgery, Plastic Surgery, Surgical\n Oncology, Pediatrics and Urology.","2011-12-15","Dr.Bhoom Reddy's Hospital, Civil Hospital\nRaod, Karimnagar.","2008-12-16","2509/LC.B/2008","Genl. Medicine,Genl. Surgery, OBG.,\n Anaesthesiology, Orthopedics, Neuro\n Surgery, Plastic Surgery, Surgical\n Oncology, Pediatrics and Urology.","2011-12-15"]
[null,118,"Dr.Ramesh Cardiac & Multi Speciality Hospital\nLtd., (City Cardiac Research Center Ltd) Ring\nRoad, Near ITI College, Vijyawada - 520008.","2006-06-27","18536/LC-B/2005","Cardiology, C.T.Surgery, General\n Medicine, General Surgery and\n Nephrology","2012-06-26","Dr.Ramesh Cardiac & Multi Speciality Hospital\nLtd., (City Cardiac Research Center Ltd) Ring\nRoad, Near ITI College, Vijyawada - 520008.","2006-06-27","18536/LC-B/2005","Cardiology, C.T.Surgery, General\n Medicine, General Surgery and\n Nephrology","2012-06-26"]
[null,119,"Dr.Sreeedhar's Kidney & Multi Speciality\nHospital, 13-6-437/I/L/I, Near Al-Quaba\nMasjid, Khadesrbagh, Nanal Nagar 'X' Road,\nMehidipatnam, Hyderabad","2010-04-24","33874/LC-B/2009","Urology","2013-04-23","Dr.Sreeedhar's Kidney & Multi Speciality\nHospital, 13-6-437/I/L/I, Near Al-Quaba\nMasjid, Khadesrbagh, Nanal Nagar 'X' Road,\nMehidipatnam, Hyderabad","2010-04-24","33874/LC-B/2009","Urology","2013-04-23"]
[null,120,"Drishti Eye Care, Flat No.114-A, Lane Opp:\nSBI, Srinagar Colony Main Road, Hyderabad.","25-May-2009","36843/LC.B/2008","Ophthalmology","24-May-2012","Drishti Eye Care, Flat No.114-A, Lane Opp:\nSBI, Srinagar Colony Main Road, Hyderabad.","25-May-2009","36843/LC.B/2008","Ophthalmology","24-May-2012"]
[null,121,"Durga Nursing Home, 20-6-138(2), Anjaiah\nRoad, Ongole, Prakasam Dist.","30-Jul-2010","14901/LC-B/2010","Ophthalmology","29-Jul-2013","Durga Nursing Home, 20-6-138(2), Anjaiah\nRoad, Ongole, Prakasam Dist.","30-Jul-2010","14901/LC-B/2010","Ophthalmology","29-Jul-2013"]
[null,122,"Durga Nursing Home, 20-6-138(2), Anjaiah\nRoad, Ongole, Prakasam Dist.","30-Jul-2010","15501/LC-B/2010","General Medicine, General Surgery,\n OBG and Paediatrics","29-Jul-2013","Durga Nursing Home, 20-6-138(2), Anjaiah\nRoad, Ongole, Prakasam Dist.","30-Jul-2010","15501/LC-B/2010","General Medicine, General Surgery,\n OBG and Paediatrics","29-Jul-2013"]
[null,123,"Durgabai Deshmukh Hospital & Research\nCentre, University Road, Vidyanagar,\nHyderabad","2009-10-24","11779/LC-B/2009","Anaesthesiology, General Medicine,\n General Surgery, ENT, OBG,\n Orthopaedics, Paediatrics, Radiology,\n Pathology, Physiotherapy, Cardiology,\n C.T.Surgery, Surgical\n Gastroenterology, Neuro Surgery,\n Surgical Oncology, Plastic Surgery,\n Urology and Nephrology","2012-10-23","Durgabai Deshmukh Hospital & Research\nCentre, University Road, Vidyanagar,\nHyderabad","2009-10-24","11779/LC-B/2009","Anaesthesiology, General Medicine,\n General Surgery, ENT, OBG,\n Orthopaedics, Paediatrics, Radiology,\n Pathology, Physiotherapy, Cardiology,\n C.T.Surgery, Surgical\n Gastroenterology, Neuro Surgery,\n Surgical Oncology, Plastic Surgery,\n Urology and Nephrology","2012-10-23"]
[null,124,"E.N.T. Nursing Home, Bhagathsingh Statu\nCenter, Kothapet, Guntur","10-Aug-2007","4929/LC.B/2007","E.N.T.","9-Aug-2010","E.N.T. Nursing Home, Bhagathsingh Statu\nCenter, Kothapet, Guntur","10-Aug-2007","4929/LC.B/2007","E.N.T.","9-Aug-2010"]
[null,125,"Eshwar Super Speciality Dental Hospital, 50-\n726-6 B, Kurnool","29-Jul-2010","6151/LC-B/2010","Dental","28-Jul-2013","Eshwar Super Speciality Dental Hospital, 50-\n726-6 B, Kurnool","29-Jul-2010","6151/LC-B/2010","Dental","28-Jul-2013"]
[null,126,"FMS Dental Hospital, Aiyangar Plaza, Bank\nStreet, Koti, Hyderbad","2006-06-09","20712/LC.B/2005","Dental","2012-06-08","FMS Dental Hospital, Aiyangar Plaza, Bank\nStreet, Koti, Hyderbad","2006-06-09","20712/LC.B/2005","Dental","2012-06-08"]
[null,127,"Frontier Lifeline Pvt. Ltd., R-30-C, Ambattur\nIndustrial 17514Estate Road, Mogappair,\nChennai","13-Apr-2007","1809/LC.B/2006","Cardiology, Cardio thoracic surgery","12-Apr-2010","Frontier Lifeline Pvt. Ltd., R-30-C, Ambattur\nIndustrial 17514Estate Road, Mogappair,\nChennai","13-Apr-2007","1809/LC.B/2006","Cardiology, Cardio thoracic surgery","12-Apr-2010"]
[null,128,"G.K.Multi Speciality Hospital, 6-1-1,\nChintkuntwada, Nirmal, Adilabad District.","7-Aug-2010","19305/LC-B/2010","Dental","6-Aug-2013","G.K.Multi Speciality Hospital, 6-1-1,\nChintkuntwada, Nirmal, Adilabad District.","7-Aug-2010","19305/LC-B/2010","Dental","6-Aug-2013"]
[null,129,"G.R.Hospital, 4-8-114, Opp. Hanamkonda\nPolice Station, Kumarpalli, Hanamkonda,\nWarangal",{"$f":"I131","v":"27-Nov-2009"},{"$f":"J131","v":"22428/LC-B/2009"},{"$f":"K131","v":"General Surgery"},{"$f":"L131","v":"26-Nov-2012"},"G.R.Hospital, 4-8-114, Opp. Hanamkonda\nPolice Station, Kumarpalli, Hanamkonda,\nWarangal","27-Nov-2009","22428/LC-B/2009","General Surgery","26-Nov-2012"]
[null,130,"Gadam Multi Speciality Dental Hospital &\nImplant Centre, 1st floor, Redman Plaza, 2nd\nLine Dwarakanagar, Visakhapatnam","22-Jan-2010","36770/LC-B/2009","Dental","21-Jan-2013","Gadam Multi Speciality Dental Hospital &\nImplant Centre, 1st floor, Redman Plaza, 2nd\nLine Dwarakanagar, Visakhapatnam","22-Jan-2010","36770/LC-B/2009","Dental","21-Jan-2013"]
[null,131,"Geetha Mullapudi International Hi-technology\nDental Hospital, 1st floor, Sri Challa Apparao\nMunicipal Complex, Near Kotipalli Bus Stand,\nRajahmundry, E..G.Dist.","2009-12-08","23538/LC-B/2009","Dental","2012-12-07","Geetha Mullapudi International Hi-technology\nDental Hospital, 1st floor, Sri Challa Apparao\nMunicipal Complex, Near Kotipalli Bus Stand,\nRajahmundry, E..G.Dist.","2009-12-08","23538/LC-B/2009","Dental","2012-12-07"]
[null,132,"Geetha Mutli Speciality Hospital,\nSeceunderabad.","2006-01-03","29526/LC-B/2005","Multi","2012-01-02","Geetha Mutli Speciality Hospital,\nSeceunderabad.","2006-01-03","29526/LC-B/2005","Multi","2012-01-02"]
[null,133,"Giridhar ENT Hospital & Laser Centre Ch.\nDurgaiah Street, Suryaraopet, Vijayawada","27-Mar-2010","48824/LC-B/2009","ENT","26-Mar-2013","Giridhar ENT Hospital & Laser Centre Ch.\nDurgaiah Street, Suryaraopet, Vijayawada","27-Mar-2010","48824/LC-B/2009","ENT","26-Mar-2013"]
[null,134,"Global Dental Hospital, Vajra Residency,\nGround Floor, Musheerabad, Hyderabad.","23-Oct-2008","46821/LC.B/2007","Dental","22-Oct-2011","Global Dental Hospital, Vajra Residency,\nGround Floor, Musheerabad, Hyderabad.","23-Oct-2008","46821/LC.B/2007","Dental","22-Oct-2011"]
[null,135,"Global Hospitals, 6-1-1070/1 to 4, Lakadi-Ka-\nPool, Hyderabad","2006-03-25","18543/LC-B/2005","Multi","2012-03-24","Global Hospitals, 6-1-1070/1 to 4, Lakadi-Ka-\nPool, Hyderabad","2006-03-25","18543/LC-B/2005","Multi","2012-03-24"]
[null,136,"Global Hospitals, Banjara Hills, Hyderabad","3-Feb-2006","20746/LC-B/2005","Multi","2009-02-02","Global Hospitals, Banjara Hills, Hyderabad","3-Feb-2006","20746/LC-B/2005","Multi","2009-02-02"]
[null,137,"Global Multi Speciality Hospital, 27-39-1, MG\nRoad, Vijayawada - 520 002","2006-06-09","21526/LC.B/2003","Anaesthesiology, General Medicine,\n General Surgery, ENT, Cardiology,\n Emergency Medicine, OBG, Surgical\n Gastroenterology, Nephrology, Neuro\n Surgery, Orthopaedics, Paediatrics,\n Plastic Surgery, Pulmonology,\n Radiology, Urology, Surgical Oncology,\n Physiotherapy and Dialysis","2012-06-08","Global Multi Speciality Hospital, 27-39-1, MG\nRoad, Vijayawada - 520 002","2006-06-09","21526/LC.B/2003","Anaesthesiology, General Medicine,\n General Surgery, ENT, Cardiology,\n Emergency Medicine, OBG, Surgical\n Gastroenterology, Nephrology, Neuro\n Surgery, Orthopaedics, Paediatrics,\n Plastic Surgery, Pulmonology,\n Radiology, Urology, Surgical Oncology,\n Physiotherapy and Dialysis","2012-06-08"]
[null,138,"Goodwill Kidney and Surgical Center, Opp.\nKhaja Mansion, Masabtank Road, Hyd.","20-Jun-2008","10926/LC.B/2008","Kidney","19-Jun-2011","Goodwill Kidney and Surgical Center, Opp.\nKhaja Mansion, Masabtank Road, Hyd.","20-Jun-2008","10926/LC.B/2008","Kidney","19-Jun-2011"]
[null,139,"Gowri Gopal Hospitals Pvt. Ltd., Kurnool","2006-01-03","19751/LC-B/2005","Multi","2012-01-02","Gowri Gopal Hospitals Pvt. Ltd., Kurnool","2006-01-03","19751/LC-B/2005","Multi","2012-01-02"]
[null,140,"Gowtami Eye Institute, 1, R.V.Nagar,\nKorukonda Road, Opp. Market Yard,\nRajahmundry, E.G.Dt.","24-Oct-2009","10422/LC-B/2009","Ophthalmology","23-Oct-2012","Gowtami Eye Institute, 1, R.V.Nagar,\nKorukonda Road, Opp. Market Yard,\nRajahmundry, E.G.Dt.","24-Oct-2009","10422/LC-B/2009","Ophthalmology","23-Oct-2012"]
[null,141,"GSL General Hospital, NH-5, Lakshmi Puram,\nRajhmundry.","20-Dec-2006","20475/LC-B/2005","Multi","19-Dec-2009","GSL General Hospital, NH-5, Lakshmi Puram,\nRajhmundry.","20-Dec-2006","20475/LC-B/2005","Multi","19-Dec-2009"]
[null,142,"Guardian Multi Speciality Hospital, 15-1-237,\nOpp. L.B.College, Mulugu 'X' Road, Warangal","2010-08-07","22488/LC-B/2010","General Medicine, General Surgery,\n Orthopaedics, OBG, Pulmonology,\n Neuro Surgery, Urology, Paediatrics,\n Pathology, Surgical Oncology, ENT,\n Plastic Surgery, Anaesthesiology and\n Physiotherapy","2013-08-06","Guardian Multi Speciality Hospital, 15-1-237,\nOpp. L.B.College, Mulugu 'X' Road, Warangal","2010-08-07","22488/LC-B/2010","General Medicine, General Surgery,\n Orthopaedics, OBG, Pulmonology,\n Neuro Surgery, Urology, Paediatrics,\n Pathology, Surgical Oncology, ENT,\n Plastic Surgery, Anaesthesiology and\n Physiotherapy","2013-08-06"]
[null,143,"Guntur Dental SpecialtyHospital, Beside\nPallavi Complex, Station Road, Guntur","21-Oct-2008","34927/LC.B/2006","Dental","20-Oct-2011","Guntur Dental SpecialtyHospital, Beside\nPallavi Complex, Station Road, Guntur","21-Oct-2008","34927/LC.B/2006","Dental","20-Oct-2011"]
[null,144,"Gurunanak Care Hospital, 1-4-908/7/1,\nMusheerabad Main Road, Musheerabad,\nHyderabad","2009-09-15","41736/LC-B/2007","Cardiology, OBG, Neuro Surgery,\n Orthoplaedics, ENT, Nephrology,\n Urology, Paediatrics, Surgical\n Gastroenterology, Gen. Surgery,\n Anaesthesiology, Plastic Surgery,\n Emergency Medicine, Surgical\n Oncology, Radiology and Pulmonology","2012-09-14","Gurunanak Care Hospital, 1-4-908/7/1,\nMusheerabad Main Road, Musheerabad,\nHyderabad","2009-09-15","41736/LC-B/2007","Cardiology, OBG, Neuro Surgery,\n Orthoplaedics, ENT, Nephrology,\n Urology, Paediatrics, Surgical\n Gastroenterology, Gen. Surgery,\n Anaesthesiology, Plastic Surgery,\n Emergency Medicine, Surgical\n Oncology, Radiology and Pulmonology","2012-09-14"]
[null,145,"GVR Childrens Hospital, 43/48, 2nd Lane,\nN.R.Pet, Kurnool - 518004.","2006-11-10","12856/LC-B/2006","Paediatrics, Urology, Plastic Surgery,\n OBG and General Surgery"," 09-11-2012","GVR Childrens Hospital, 43/48, 2nd Lane,\nN.R.Pet, Kurnool - 518004.","2006-11-10","12856/LC-B/2006","Paediatrics, Urology, Plastic Surgery,\n OBG and General Surgery"," 09-11-2012"]
[null,146,"Harini Gastro & Liver Centre, 29-14-51,\nPrakasam Road, Suryaraopet, Vijayawada.","17-Feb-2007","17827/LC-B/2006","Gastroenterology","16-Feb-2010","Harini Gastro & Liver Centre, 29-14-51,\nPrakasam Road, Suryaraopet, Vijayawada.","17-Feb-2007","17827/LC-B/2006","Gastroenterology","16-Feb-2010"]
[null,147,"Haripriya Dantha Vaidyasala, 18-1-503, V.V.\nMahal Road, Opp. Incometax Office, Tirupathi","15-Dec-2008","21075/LC.B/2007","Dental","14-Dec-2011","Haripriya Dantha Vaidyasala, 18-1-503, V.V.\nMahal Road, Opp. Incometax Office, Tirupathi","15-Dec-2008","21075/LC.B/2007","Dental","14-Dec-2011"]
[null,148,"Harsha Sai Eye Hospital, Dwarakanagar,\nNizamabad.","19-Feb-2008","18010/LC.B/2007","Ophthalmology","18-Feb-2011","Harsha Sai Eye Hospital, Dwarakanagar,\nNizamabad.","19-Feb-2008","18010/LC.B/2007","Ophthalmology","18-Feb-2011"]
[null,149,"Health Hospitals Prakasam Road, Tenali -\n522201,Guntur District.","2007-02-17","19354/LC-B/2006","Cardiology, ENT, General Medicine,\n Emergency Medicine, General Surgery,\n Obst & Gynecology, Orthopedics,\n Pediatrics, Neuro Surgery, Plastic\n Surgery, Surgical Gastroentrology,\n Urology, Pulmonology, Physiotherapy\n Unit and Clinical Pathology Services","2010-02-16","Health Hospitals Prakasam Road, Tenali -\n522201,Guntur District.","2007-02-17","19354/LC-B/2006","Cardiology, ENT, General Medicine,\n Emergency Medicine, General Surgery,\n Obst & Gynecology, Orthopedics,\n Pediatrics, Neuro Surgery, Plastic\n Surgery, Surgical Gastroentrology,\n Urology, Pulmonology, Physiotherapy\n Unit and Clinical Pathology Services","2010-02-16"]
[null,150,"Heart Care Centre, Dornakal Raod, Near\nAndhra Bank, Suryaraopet, Vijayawada.","2006-08-24","25958/LC-B/2005","Cardiology","2012-08-23","Heart Care Centre, Dornakal Raod, Near\nAndhra Bank, Suryaraopet, Vijayawada.","2006-08-24","25958/LC-B/2005","Cardiology","2012-08-23"]
[null,151,"Help Hospital, MG Road, Vijayawada","2006-01-03","18470/LC-B/2005","Gen. Med. Orthopedics, Anesthesiolgy,\n Neuro Surgery, Gen. Surgeryand\n Gynec.","2012-01-02","Help Hospital, MG Road, Vijayawada","2006-01-03","18470/LC-B/2005","Gen. Med. Orthopedics, Anesthesiolgy,\n Neuro Surgery, Gen. Surgeryand\n Gynec.","2012-01-02"]
[null,152,"Heritage Hospital, 6-3-907/2, Somajiguda,\nHyderabad","19-Jan-2006","22130/LC-B/2005","Multi","18-Jan-2009","Heritage Hospital, 6-3-907/2, Somajiguda,\nHyderabad","19-Jan-2006","22130/LC-B/2005","Multi","18-Jan-2009"]
[null,153,"Himabindu Multi Specialty Hospital, Vinay\nNagar, Sagar Road, Santhoshnagar, Hyd.","2008-07-03","1082/LC.B/2008","Genl. Medicine, Genl. Surgery, OBG.,\n Orthopedics, Urology, Neuro Surgery,\n Plastic Surgery, ENT., Pediatrics,\n Cardiology, Surgical Gastroentrology,\n Anesthesiology, Pulmonology,\n Radiology, Pathology, Oncology, and\n Physiotherapy.","2011-07-02","Himabindu Multi Specialty Hospital, Vinay\nNagar, Sagar Road, Santhoshnagar, Hyd.","2008-07-03","1082/LC.B/2008","Genl. Medicine, Genl. Surgery, OBG.,\n Orthopedics, Urology, Neuro Surgery,\n Plastic Surgery, ENT., Pediatrics,\n Cardiology, Surgical Gastroentrology,\n Anesthesiology, Pulmonology,\n Radiology, Pathology, Oncology, and\n Physiotherapy.","2011-07-02"]
[null,154,"Hope Childrens Hospital, 5-9-24/81, Lake Hills\nRoad, Basheerbagh, Hyderabad - 500463.","3-Apr-2007","13646/LC-B/2006","Paediatric","2010-04-02","Hope Childrens Hospital, 5-9-24/81, Lake Hills\nRoad, Basheerbagh, Hyderabad - 500463.","3-Apr-2007","13646/LC-B/2006","Paediatric","2010-04-02"]
[null,155,"Hope Super SpecialtyHospital, Balaji Nagar,\nKhammam","2008-04-18","309/LC.B/2007","Neurology, Neuro Surgery, Genl.\n Medicine, Genl. Surgery, Orthopedics,\n OBG., Pediatrics, Cardiology, and\n Emergency Medicine","2011-04-17","Hope Super SpecialtyHospital, Balaji Nagar,\nKhammam","2008-04-18","309/LC.B/2007","Neurology, Neuro Surgery, Genl.\n Medicine, Genl. Surgery, Orthopedics,\n OBG., Pediatrics, Cardiology, and\n Emergency Medicine","2011-04-17"]
[null,156,"Hyderabad Kidney & Laproscopic Centre,\nJudges Colony,Malakpet, Hyderabad.","2006-01-03","29526/LC-B/2005","Urology, Nephrology, General\n Surgery, Surgical Gastroenterology\n and Orthopaedics","2012-01-02","Hyderabad Kidney & Laproscopic Centre,\nJudges Colony,Malakpet, Hyderabad.","2006-01-03","29526/LC-B/2005","Urology, Nephrology, General\n Surgery, Surgical Gastroenterology\n and Orthopaedics","2012-01-02"]
[null,157,"Hyderabad Nusing Home Pvt. Ltd.,\nBasheerbagh, Hyderabad.","2008-04-17","3836/LC.B/2006","General Medicine, Genl. Surgery,\n Anaesthesiology, Emergency\n Medicine, E.N.T., OBG., Orthopedics,\n Pediatrics, Pathology, Plastic Surgery,\n Radiology, Surgical Gastroenterology,\n Medical Oncology, Surgical Oncology,\n Urology and Physiotherapy.","2011-04-16","Hyderabad Nusing Home Pvt. Ltd.,\nBasheerbagh, Hyderabad.","2008-04-17","3836/LC.B/2006","General Medicine, Genl. Surgery,\n Anaesthesiology, Emergency\n Medicine, E.N.T., OBG., Orthopedics,\n Pediatrics, Pathology, Plastic Surgery,\n Radiology, Surgical Gastroenterology,\n Medical Oncology, Surgical Oncology,\n Urology and Physiotherapy.","2011-04-16"]
[null,158,"Identity Multi Specialty Dental Hospital and\nResearch Center, 21/139, R.S. Road, Kadapa.","3-Feb-2009","14278/LC.B/2008","Dental","2-Feb-2012","Identity Multi Specialty Dental Hospital and\nResearch Center, 21/139, R.S. Road, Kadapa.","3-Feb-2009","14278/LC.B/2008","Dental","2-Feb-2012"]
[null,159,"Image Hospital, 8-3-903/F/12 & 13, Image\nHouse, Ameerpet, Hyderabad","2006-03-18","21092/LC-B/2005","Cardiology, C.T.Surgery, Neuro\n Surgery, Orthopaedics, Surgical\n Gastroenterology, Pulmonology, OBG,\n Nephrology, Urology, General\n Medicine, General Surgery, ENT,\n Paediatrics and Dialysis Unit","2012-03-17","Image Hospital, 8-3-903/F/12 & 13, Image\nHouse, Ameerpet, Hyderabad","2006-03-18","21092/LC-B/2005","Cardiology, C.T.Surgery, Neuro\n Surgery, Orthopaedics, Surgical\n Gastroenterology, Pulmonology, OBG,\n Nephrology, Urology, General\n Medicine, General Surgery, ENT,\n Paediatrics and Dialysis Unit","2012-03-17"]
[null,160,"Image Hospitals, 1-90/2/G/2, Arunodaya Co-\noperative Housing Society, Madhapur,\nHyderabad","2009-12-08","26548/LC-B/2009","Cardiology, C.T.Surgery, Neuro\n Surgery, Orthopaedics, General\n Medicine, Pulmonology, Radiology,\n Medical Oncology, OBG, Paediatrics,\n Urology, ENT and Emergency\n Medicine","2012-12-07","Image Hospitals, 1-90/2/G/2, Arunodaya Co-\noperative Housing Society, Madhapur,\nHyderabad","2009-12-08","26548/LC-B/2009","Cardiology, C.T.Surgery, Neuro\n Surgery, Orthopaedics, General\n Medicine, Pulmonology, Radiology,\n Medical Oncology, OBG, Paediatrics,\n Urology, ENT and Emergency\n Medicine","2012-12-07"]
[null,161,"Indian Red Cross Society, Red Cross Road,\nNear Vegitable Market, Nellore.","2008-10-14","1871/LC.B/2006","Oncology","13-Oct-2011","Indian Red Cross Society, Red Cross Road,\nNear Vegitable Market, Nellore.","2008-10-14","1871/LC.B/2006","Oncology","13-Oct-2011"]
[null,162,"Indira Multi Speciality Dental Hospital, 16-2-\n307, Near Sunday Market, Subrahmanya\nSwamy Temple Street, Pogathota, Nellore","7-Jul-2009","1600/LC-B/2009","Dental","6-Jul-2012","Indira Multi Speciality Dental Hospital, 16-2-\n307, Near Sunday Market, Subrahmanya\nSwamy Temple Street, Pogathota, Nellore","7-Jul-2009","1600/LC-B/2009","Dental","6-Jul-2012"]
[null,163,"Indo- American Cancer Institute & Research\nCentre, Banjara Hills, Hyderabad","2005-12-05","18434/LC-B/2005","Cancer","2011-12-04","Indo- American Cancer Institute & Research\nCentre, Banjara Hills, Hyderabad","2005-12-05","18434/LC-B/2005","Cancer","2011-12-04"]
[null,164,"Indur Cancer Hospital, Krishnapuri Colony,\nMadhavanagar, Nizamabad","08-Dec-2009","19098/LC-B/2009","Cancer","07-Dec-2012","Indur Cancer Hospital, Krishnapuri Colony,\nMadhavanagar, Nizamabad","08-Dec-2009","19098/LC-B/2009","Cancer","07-Dec-2012"]
[null,165,"Indus Hospitals, 18-1-6, K.G.H. Down Road,\nMaharanipet, Visakhapatnam","2008-10-23","2037/LC.B/2008","Anaesthesiology, Cardiology, C.T.\n Surgery, E.N.T., Emergency Medicine,\n Genl. Medicine, Genl. Surgery,\n Nephrology, Neuro Surgery,\n Pulmanology, Radiology, Surgical\n Gastro Enterology, Oncology, and\n Dialysis Unit.","2011-10-22","Indus Hospitals, 18-1-6, K.G.H. Down Road,\nMaharanipet, Visakhapatnam","2008-10-23","2037/LC.B/2008","Anaesthesiology, Cardiology, C.T.\n Surgery, E.N.T., Emergency Medicine,\n Genl. Medicine, Genl. Surgery,\n Nephrology, Neuro Surgery,\n Pulmanology, Radiology, Surgical\n Gastro Enterology, Oncology, and\n Dialysis Unit.","2011-10-22"]
[null,166,"Innova Children's Heart Hospital Pvt., Ltd., 12-\n5-30, White House, Tarnaka, Moulali Road,\nSecunderabad","13-Aug-2008","42244/LC.B/2007","Pediatric Specialization","12-Aug-2011","Innova Children's Heart Hospital Pvt., Ltd., 12-\n5-30, White House, Tarnaka, Moulali Road,\nSecunderabad","13-Aug-2008","42244/LC.B/2007","Pediatric Specialization","12-Aug-2011"]
[null,167,"J.J.Dental Clinic, Temple Street, Kakinada,\nE.G.Dist.","8-Dec-2009","33969/LC-B/2009","Dental","07-Dec-2012","J.J.Dental Clinic, Temple Street, Kakinada,\nE.G.Dist.","8-Dec-2009","33969/LC-B/2009","Dental","07-Dec-2012"]
[null,168,"J.J.Hospital, Plot No. 57, Kalyan Nagar, 1st\nPhase, Behind T.B.Hospital, Hyderabad","24-Apr-2010","20033/LC-B/2008","Obstetrics & Gynaecology","23-Apr-2013","J.J.Hospital, Plot No. 57, Kalyan Nagar, 1st\nPhase, Behind T.B.Hospital, Hyderabad","24-Apr-2010","20033/LC-B/2008","Obstetrics & Gynaecology","23-Apr-2013"]
[null,169,"Jabilli Mother & Child Hospital, Beside\nChurch, Wyra Road, Khammam.","1-Aug-2009","19134/LC-B/2009","Gen. Med. Gen. Surgery, OBG\n Pediatrics, Orthopaedics and Plastic\n Surgery","31-Jul-2012","Jabilli Mother & Child Hospital, Beside\nChurch, Wyra Road, Khammam.","1-Aug-2009","19134/LC-B/2009","Gen. Med. Gen. Surgery, OBG\n Pediatrics, Orthopaedics and Plastic\n Surgery","31-Jul-2012"]
[null,170,"Jaya Hospitals, Chowrastha, Hanamkonda,\nWarangal","2006-07-22","20303/LC-B/2005","General Medicine, General Surgery,\n Anaesthesiology, Emergency\n Medicine, Cardiology, C.T.Surgery,\n ENT, OBG, Paediatrics, Urology,\n Orthopaedics, Neuro Surgery,\n Pulmonology, Plastic Surgery,\n Pathology, Surgical Oncology and\n Physiotherapy","2013-07-21","Jaya Hospitals, Chowrastha, Hanamkonda,\nWarangal","2006-07-22","20303/LC-B/2005","General Medicine, General Surgery,\n Anaesthesiology, Emergency\n Medicine, Cardiology, C.T.Surgery,\n ENT, OBG, Paediatrics, Urology,\n Orthopaedics, Neuro Surgery,\n Pulmonology, Plastic Surgery,\n Pathology, Surgical Oncology and\n Physiotherapy","2013-07-21"]
[null,171,"Jayabharath Hospital, 16/2884,\nSomasekharapuram, Nellore","2008-12-12","43400/LC.B/2007","Anaesthesiology, Emergency\n Medicine, General Surgery, General\n Medicine, OBG., Orthopedics, Plastic\n Surgery, Urology, E.N.T., Pediatrics,\n Pathology, Radiology and Physio-\n therapy","2011-12-11","Jayabharath Hospital, 16/2884,\nSomasekharapuram, Nellore","2008-12-12","43400/LC.B/2007","Anaesthesiology, Emergency\n Medicine, General Surgery, General\n Medicine, OBG., Orthopedics, Plastic\n Surgery, Urology, E.N.T., Pediatrics,\n Pathology, Radiology and Physio-\n therapy","2011-12-11"]
[null,172,"Jayalakshmi Hospitals, 9-5-15, J.P.N. Road,\nWarangal","13-May-2009","5912/LC.B/2009","OBG","12-May-2012","Jayalakshmi Hospitals, 9-5-15, J.P.N. Road,\nWarangal","13-May-2009","5912/LC.B/2009","OBG","12-May-2012"]
[null,173,"Jayam Super Specialty Dental Hospital, Shop\nNo. 15 and 16, Municipal Shopping Complex,\nAnanthapur","18-Feb-2009","30888/LC.B/2008","Dental","17-Feb-2012","Jayam Super Specialty Dental Hospital, Shop\nNo. 15 and 16, Municipal Shopping Complex,\nAnanthapur","18-Feb-2009","30888/LC.B/2008","Dental","17-Feb-2012"]
[null,174,"Jeevana Jyothi Hospitals, D.No. 15/381,\nKamalanagar, Anantapur","09-Oct-2009","15689/LC-B/2009","General Medicine, General Surgery,\n OBG, Orthopaedics, Cardiology and\n Urology","08-Oct-2012","Jeevana Jyothi Hospitals, D.No. 15/381,\nKamalanagar, Anantapur","09-Oct-2009","15689/LC-B/2009","General Medicine, General Surgery,\n OBG, Orthopaedics, Cardiology and\n Urology","08-Oct-2012"]
[null,175,"Jnanananda Ophthalmic Institute,\nBhimavaram, W.G. Dist.","22-May-2008","41288/LC.B/2007","Ophthalmology","21-May-2011","Jnanananda Ophthalmic Institute,\nBhimavaram, W.G. Dist.","22-May-2008","41288/LC.B/2007","Ophthalmology","21-May-2011"]
[null,176,"Jyothi Hospitals, 19/1350, Beside Anjaneya\nSwamy Temple, Church Road, Miryalaguda,\nNalgonda.","2008-12-15","2898/LC.B/2008","General Medicine,General Surgery,\n Anaesthesiology, E.N.T., OBG.,\n Orthopedics, Pediatrics, Pathology,\n urology, Cardiology, Radiology and\n Physio Therapy.","\n 14-Dec-2011","Jyothi Hospitals, 19/1350, Beside Anjaneya\nSwamy Temple, Church Road, Miryalaguda,\nNalgonda.","2008-12-15","2898/LC.B/2008","General Medicine,General Surgery,\n Anaesthesiology, E.N.T., OBG.,\n Orthopedics, Pediatrics, Pathology,\n urology, Cardiology, Radiology and\n Physio Therapy.","\n 14-Dec-2011"]
[null,177,"K.M. Dental Hosptials, Global Nagar, Munbai\nRoad, Buchireddy Palem, Nellore","2009-03-20","44722/LC.B/2008","Dental","19-Mar-2012","K.M. Dental Hosptials, Global Nagar, Munbai\nRoad, Buchireddy Palem, Nellore","2009-03-20","44722/LC.B/2008","Dental","19-Mar-2012"]
[null,178,"Kadapa Super Speciality Dental Hospital\n4/468, Behind Ramalayam, Kadapa","11-Mar-2010","42760/LC-B/2009","Dental","10-Mar-2013","Kadapa Super Speciality Dental Hospital\n4/468, Behind Ramalayam, Kadapa","11-Mar-2010","42760/LC-B/2009","Dental","10-Mar-2013"]
[null,179,"Kakathiya Super Specialty Dental Hospital,\nHanumakonda, Warangal.","6-Nov-2008","24076/LC.B/2006","Dental","5-Nov-2011","Kakathiya Super Specialty Dental Hospital,\nHanumakonda, Warangal.","6-Nov-2008","24076/LC.B/2006","Dental","5-Nov-2011"]
[null,180,"Kalyani Dental Hospital Dentistry & Implant\nCentre, Opp. Green Park Hotel, Begumpet,\nHyderabad.","2005-12-05","18469/LC-B/2005","Dental","2011-12-04","Kalyani Dental Hospital Dentistry & Implant\nCentre, Opp. Green Park Hotel, Begumpet,\nHyderabad.","2005-12-05","18469/LC-B/2005","Dental","2011-12-04"]
[null,181,"Kalyani Hospital, 6-1-69, Stadium Road,\nHanumakonda, Warangal.","16-Jan-2009","10437/LC.B/2007","Genl. Medicine,Genl. Surgery,\n Orthopedics, OBG., Urology, E.N.T.,\n and Pulmanology.","15-Jan-2012","Kalyani Hospital, 6-1-69, Stadium Road,\nHanumakonda, Warangal.","16-Jan-2009","10437/LC.B/2007","Genl. Medicine,Genl. Surgery,\n Orthopedics, OBG., Urology, E.N.T.,\n and Pulmanology.","15-Jan-2012"]
[null,182,"Kamal Vilekar's Multi Speciality Dental\nHospital, D.No. 6-2-15, Chinna Bazar,\nSrikakulam","22-Jan-2010","1598/LC-B/2009","Dental","21-Jan-2013","Kamal Vilekar's Multi Speciality Dental\nHospital, D.No. 6-2-15, Chinna Bazar,\nSrikakulam","22-Jan-2010","1598/LC-B/2009","Dental","21-Jan-2013"]
[null,183,"Kamala Hospital, Kamala Complex, Chandna\nBrother's Center, Dilsuknagar, Hyderabad.","2008-08-29","\n\n 14767/LC.B./2008","Anaesthesiology, Cardiology, E.N.T.,\n Emergency Medicine, Genl. Medicine,\n Genl. Surgery, Neuro Surgery, OBG.,\n Orthopedics, Nephrology, Pediatrics,\n Pathology, Radiology, Urology,\n Oncology, and Dialysis Unit.","2011-08-28","Kamala Hospital, Kamala Complex, Chandna\nBrother's Center, Dilsuknagar, Hyderabad.","2008-08-29","\n\n 14767/LC.B./2008","Anaesthesiology, Cardiology, E.N.T.,\n Emergency Medicine, Genl. Medicine,\n Genl. Surgery, Neuro Surgery, OBG.,\n Orthopedics, Nephrology, Pediatrics,\n Pathology, Radiology, Urology,\n Oncology, and Dialysis Unit.","2011-08-28"]
[null,184,"Kamineni Hospitals ( Previously called\nWockhadt Hospitals which is taken over by\nthe Management of kamineni Hospitas) 4-1-\n1227, King Koti Road, Abids, Hyderabad –\n500001.","2006-10-17","21452/LC-B/2005","General Medicine, General Surgery,\n Emergency Medicine, Cardiology,\n C.T.Surgery, OBG, Paediatrics,\n Orthopaedics, ENT, Anaesthesiology,\n Nuero Surgery, Surgical Oncology,\n Surgical Gastroenterology, Urology,\n Nephrology and Dialysis."," 17-10-2009","Kamineni Hospitals ( Previously called\nWockhadt Hospitals which is taken over by\nthe Management of kamineni Hospitas) 4-1-\n1227, King Koti Road, Abids, Hyderabad –\n500001.","2006-10-17","21452/LC-B/2005","General Medicine, General Surgery,\n Emergency Medicine, Cardiology,\n C.T.Surgery, OBG, Paediatrics,\n Orthopaedics, ENT, Anaesthesiology,\n Nuero Surgery, Surgical Oncology,\n Surgical Gastroenterology, Urology,\n Nephrology and Dialysis."," 17-10-2009"]
[null,185,"Kamineni Hospitals, Basheer Bagh,\nHyderabad.","2008-10-21","11828/LC.B/2007","Anaesthesiology, E.N.T., Emergency\n Medicine, General Medicine, General\n Surgery, Neuro Surgery, OBG.,\n Orthopedics, Pediatrics, Pathology,\n Plastic Surgery, Pulmanology,\n Cardiology, Oncology, Urology and\n Physiotherapy","2011-10-20","Kamineni Hospitals, Basheer Bagh,\nHyderabad.","2008-10-21","11828/LC.B/2007","Anaesthesiology, E.N.T., Emergency\n Medicine, General Medicine, General\n Surgery, Neuro Surgery, OBG.,\n Orthopedics, Pediatrics, Pathology,\n Plastic Surgery, Pulmanology,\n Cardiology, Oncology, Urology and\n Physiotherapy","2011-10-20"]
[null,186,"Kamineni Hospitals, L.B.Nagar, Hyderabad","2006-02-03","21625/LC-B/2005","Multi","2012-02-02","Kamineni Hospitals, L.B.Nagar, Hyderabad","2006-02-03","21625/LC-B/2005","Multi","2012-02-02"]
[null,187,"Kamineni Institute of Medical Sciences and\nHospital, Sripuram, Narketpally, Nalgonda.","2007-11-06","17822/LC.B/2006","Anaesthesiology, General Medicine,\n General Surgery, E.N.T., Emergency\n Medicine, Nephrology, Neuro Surgery,\n Neclear Medicine, OBG., Orthopedics,\n Pediatrics, Pathology, Plastic Surgery,\n Pulmanology, Radiology, Oncology,\n Urology, Physio Therapy unit and\n Dialysis","2010-11-05","Kamineni Institute of Medical Sciences and\nHospital, Sripuram, Narketpally, Nalgonda.","2007-11-06","17822/LC.B/2006","Anaesthesiology, General Medicine,\n General Surgery, E.N.T., Emergency\n Medicine, Nephrology, Neuro Surgery,\n Neclear Medicine, OBG., Orthopedics,\n Pediatrics, Pathology, Plastic Surgery,\n Pulmanology, Radiology, Oncology,\n Urology, Physio Therapy unit and\n Dialysis","2010-11-05"]
[null,188,"Kandukuri Hospitals, Vishnava Street, Kavali,\nNellore, Dist.","23-Apr-2008","35266/LC.B/2006","Genl. Medicine, Genl. Surgery,\n Orthopedics and OBG.","2011-04-22","Kandukuri Hospitals, Vishnava Street, Kavali,\nNellore, Dist.","23-Apr-2008","35266/LC.B/2006","Genl. Medicine, Genl. Surgery,\n Orthopedics and OBG.","2011-04-22"]
[null,189,"Karumuri Super Speciality Hospitals, 3-4-73,\nOld Club Road, Guntur - 522001.","2006-09-23","16866/LC-B/2006","Cardiaology","2012-09-22","Karumuri Super Speciality Hospitals, 3-4-73,\nOld Club Road, Guntur - 522001.","2006-09-23","16866/LC-B/2006","Cardiaology","2012-09-22"]
[null,190,"Kinnera Super Speciality Hospital, Wyra\nRoad, Khammam","2006-07-22","4445/LC-B/2005","General Medicine, General Surgery,\n Anaesthesiology, OBG, Orthopaedics,\n Neuro Surgery, ENT, Urology, Plastic\n Surgery, Pathology, Radiology and\n Physiotherapy","2012-07-21","Kinnera Super Speciality Hospital, Wyra\nRoad, Khammam","2006-07-22","4445/LC-B/2005","General Medicine, General Surgery,\n Anaesthesiology, OBG, Orthopaedics,\n Neuro Surgery, ENT, Urology, Plastic\n Surgery, Pathology, Radiology and\n Physiotherapy","2012-07-21"]
[null,191,"KNM Smile Dental Hospital, 104, Sai Towers,\nBeside Kalaniketan, Main Road, Dilshuk\nNagar, Hyderabad.The hospital was shifted to\nG-5, Kochar Apartments, Opp. Pantaloons &\nSony Centre, Shamlal Buildings, Begumpet,\nHyderabad","2006-09-23","14473/LC-B/2006","Dental","2012-09-22","KNM Smile Dental Hospital, 104, Sai Towers,\nBeside Kalaniketan, Main Road, Dilshuk\nNagar, Hyderabad.The hospital was shifted to\nG-5, Kochar Apartments, Opp. Pantaloons &\nSony Centre, Shamlal Buildings, Begumpet,\nHyderabad","2006-09-23","14473/LC-B/2006","Dental","2012-09-22"]
[null,192,"Kommineni Super Speciality Dental Hospital,\n490A, 1st Floor, Reddy & Reddy Colony,\nTirupathi","30-Sep-2009","22568/LC-B/2009","Dental","21-Sept-2012","Kommineni Super Speciality Dental Hospital,\n490A, 1st Floor, Reddy & Reddy Colony,\nTirupathi","30-Sep-2009","22568/LC-B/2009","Dental","21-Sept-2012"]
[null,193,"Konark Hospitals, Plot No.13 and 14, Beside\nSharwood Public School, Patbasheerbad\nVillage, Qutubullapur Mandal, Kompally,\nR.R.Dist.",{"$f":"I195","v":"2010-05-13"},{"$f":"J195","v":"2985/LC-B/2010"},{"$f":"K195","v":"General Medicine, General Surgery,\n ENT, Neuro Surgery, OBG,\n Orthopaedics, Pathology, Plastic\n Surgery, Radiology, Urology and\n Physiotherapy"},{"$f":"L195","v":"2013-05-12"},"Konark Hospitals, Plot No.13 and 14, Beside\nSharwood Public School, Patbasheerbad\nVillage, Qutubullapur Mandal, Kompally,\nR.R.Dist.","2010-05-13","2985/LC-B/2010","General Medicine, General Surgery,\n ENT, Neuro Surgery, OBG,\n Orthopaedics, Pathology, Plastic\n Surgery, Radiology, Urology and\n Physiotherapy","2013-05-12"]
[null,194,"Konaseema Institute of Medical Sciences, NH -\n214, Chaitanya Nagar, Amalapuram - 533\n201, East Godavari.","3-Jul-2006","2453/LC.B/2005","Multi","2009-07-02","Konaseema Institute of Medical Sciences, NH -\n214, Chaitanya Nagar, Amalapuram - 533\n201, East Godavari.","3-Jul-2006","2453/LC.B/2005","Multi","2009-07-02"]
[null,195,"Krishna Children's Hospital, (A unit of Ashwik\nHospital Pvt Ltd), 11-5-423/A&B, Niloufer\nHospital Road, Opp-Hanuman Temple,\nLakdikapool, Hyderabad - 500006.","2006-06-27","18483/LC-B/2005","Paediatric","2012-06-26","Krishna Children's Hospital, (A unit of Ashwik\nHospital Pvt Ltd), 11-5-423/A&B, Niloufer\nHospital Road, Opp-Hanuman Temple,\nLakdikapool, Hyderabad - 500006.","2006-06-27","18483/LC-B/2005","Paediatric","2012-06-26"]
[null,196,"Krishna Denta Cure Advanced Super\nSpecialty Dental Hospital, 29-33-9/10, Alluri\nSitharamaraju Junction, Rajahmundry","2008-09-15","6974/LC.B/2007","Dental","2011-09-14","Krishna Denta Cure Advanced Super\nSpecialty Dental Hospital, 29-33-9/10, Alluri\nSitharamaraju Junction, Rajahmundry","2008-09-15","6974/LC.B/2007","Dental","2011-09-14"]
[null,197,"Krishna Institute of Medical Sceinces, Minister\nRoad, Begumpet, Hyderabad.","2005-10-24","5380/LC-B/2005","Multi","2011-10-23","Krishna Institute of Medical Sceinces, Minister\nRoad, Begumpet, Hyderabad.","2005-10-24","5380/LC-B/2005","Multi","2011-10-23"]
[null,198,"Kurnool Heart & Brain Centre, 43-1-1-K-B-4,\nSapthagiri Nagar, A-Camp Extension, Near\nNew Ayyappa swamy Temple, Kurnool.","2006-11-10","10242/LC-B/2006","General Medicine, General Surgery,\n Cardiology, C.T.Surgery, Neuro\n Surgery, Nephrology, Plastic Surgery,\n ENT, OBG, Paediatrics, Pulmonology\n and Urology","2012-11-09","Kurnool Heart & Brain Centre, 43-1-1-K-B-4,\nSapthagiri Nagar, A-Camp Extension, Near\nNew Ayyappa swamy Temple, Kurnool.","2006-11-10","10242/LC-B/2006","General Medicine, General Surgery,\n Cardiology, C.T.Surgery, Neuro\n Surgery, Nephrology, Plastic Surgery,\n ENT, OBG, Paediatrics, Pulmonology\n and Urology","2012-11-09"]
[null,199,"L.K. Hospitals Pvt. Ltd., 4-159 & 4-172,\nMaruthi Nagar, Malkajgiri, Ranga Reddy Dist.","2006-07-22","1354/LC-B/2005","Anaesthesioogy, General Medicine,\n General Surgery, Emergency Medicine,\n Cardiology, C.T.Surgery, ENT, OBG,\n Paediatrics, Radiology, Pathology,\n Urology, Nephrology, Plastic Surgery,\n Orthopaedics, Pulmonology, Surgical\n Oncology and Physiotherapy","2012-07-21","L.K. Hospitals Pvt. Ltd., 4-159 & 4-172,\nMaruthi Nagar, Malkajgiri, Ranga Reddy Dist.","2006-07-22","1354/LC-B/2005","Anaesthesioogy, General Medicine,\n General Surgery, Emergency Medicine,\n Cardiology, C.T.Surgery, ENT, OBG,\n Paediatrics, Radiology, Pathology,\n Urology, Nephrology, Plastic Surgery,\n Orthopaedics, Pulmonology, Surgical\n Oncology and Physiotherapy","2012-07-21"]
[null,200,"Lakkireddy 'Dental' Super Speciality Hospital,\n43/39-A, 2nd Line, N.R.Peta, Kurnool","23-Dec-2009","26559/LC-B/2009","Dental","22-Dec-2012","Lakkireddy 'Dental' Super Speciality Hospital,\n43/39-A, 2nd Line, N.R.Peta, Kurnool","23-Dec-2009","26559/LC-B/2009","Dental","22-Dec-2012"]
[null,201,"Lalitha Eye Hospital, 15/246, Thikkana\nTelephone Bhavan Exchange Street,\nBrindavanam, Nellore","26-May-2010","6555/LC-B/2010","Ophthalmology","25-May-2013","Lalitha Eye Hospital, 15/246, Thikkana\nTelephone Bhavan Exchange Street,\nBrindavanam, Nellore","26-May-2010","6555/LC-B/2010","Ophthalmology","25-May-2013"]
[null,202,"Lalitha Superspeciality Hospital Heart & Brain\nCentre, Gowrisankar Theatre Road, Kothapet,\nGuntur.","24-Oct-2005","1246/LC-B/2005","Multi","2008-11-14","Lalitha Superspeciality Hospital Heart & Brain\nCentre, Gowrisankar Theatre Road, Kothapet,\nGuntur.","24-Oct-2005","1246/LC-B/2005","Multi","2008-11-14"]
[null,203,"Latha Super Specialities, 29-14-58, Prakasam\nRoad, Suryaraopet, Vijayawada","2009-08-29","18657/LC-B/2009","Gen. Med. Gen. Surgery, OBG,\n Orthopaedics, Neuro Surgesry,\n Urology, Cardiology, Nephrology,\n Paediatrics and Surgical\n Gastroentesrology","2012-08-28","Latha Super Specialities, 29-14-58, Prakasam\nRoad, Suryaraopet, Vijayawada","2009-08-29","18657/LC-B/2009","Gen. Med. Gen. Surgery, OBG,\n Orthopaedics, Neuro Surgesry,\n Urology, Cardiology, Nephrology,\n Paediatrics and Surgical\n Gastroentesrology","2012-08-28"]
[null,204,"Laxmi Narasimha Hospital, Nayeem Nagar,\nHanamkonda, Warangal.","17-Jul-2008","657/LC.B/2008","Obstt. and Gynec.","16-Jul-2011","Laxmi Narasimha Hospital, Nayeem Nagar,\nHanamkonda, Warangal.","17-Jul-2008","657/LC.B/2008","Obstt. and Gynec.","16-Jul-2011"]
[null,205,"Lazarus Hospital, Waltair main road,\nVisakhapatnam","2006-01-03","18525/LC-B/2005","Anaesthesiology, General Medicine,\n General Susrgery, ENT, Emergency\n Medicine, Nephrology, Neuro Surgery,\n OBG, Paediatrics, Pathology, Plastic\n Surgery, Pulmonology, Radiology,\n Surgical Gastroentesrology and\n Dialysis","2012-01-02","Lazarus Hospital, Waltair main road,\nVisakhapatnam","2006-01-03","18525/LC-B/2005","Anaesthesiology, General Medicine,\n General Susrgery, ENT, Emergency\n Medicine, Nephrology, Neuro Surgery,\n OBG, Paediatrics, Pathology, Plastic\n Surgery, Pulmonology, Radiology,\n Surgical Gastroentesrology and\n Dialysis","2012-01-02"]
[null,206,"Life Hospitals 2-2-12/3/C, Durgabai\nDeshmukh Centre, Shivam Road, D.D.\nColony, Hyderabad - 500 007","2006-06-09","837/LC.B/2005","Anaesthesiology, Cardiology,\n C.T.Surgery, ENT, Emergency\n Medicine, General Medicine, General\n Surgery, Nephrology, Neuro Surgery,\n OBG, Orthopaedics, Paediatrics,\n Pathology, Plastic Surgery,\n Pulmonology, Radiology, Urology,\n Physiotherapy and Dialysis Unit","2012-06-08","Life Hospitals 2-2-12/3/C, Durgabai\nDeshmukh Centre, Shivam Road, D.D.\nColony, Hyderabad - 500 007","2006-06-09","837/LC.B/2005","Anaesthesiology, Cardiology,\n C.T.Surgery, ENT, Emergency\n Medicine, General Medicine, General\n Surgery, Nephrology, Neuro Surgery,\n OBG, Orthopaedics, Paediatrics,\n Pathology, Plastic Surgery,\n Pulmonology, Radiology, Urology,\n Physiotherapy and Dialysis Unit","2012-06-08"]
[null,207,"Life Kare Dental Hospital, 9-7-83/1, Sri Laxmi\nComplex, Maruthi Nagar, Santhosh Nagar,\nHyderabad - 500059.","2006-09-23","14471/LC-B/2006","Dental","2012-09-22","Life Kare Dental Hospital, 9-7-83/1, Sri Laxmi\nComplex, Maruthi Nagar, Santhosh Nagar,\nHyderabad - 500059.","2006-09-23","14471/LC-B/2006","Dental","2012-09-22"]
[null,208,"Life Line Hospitals, 2-4-152, Ram Nagar,\nHanmakonda, Warangal District.","2007-04-03","31212/LC-B/2006","Gen. Medicine, Gen. Surgery, ENT,\n OBG, Paediatrics, Neurology, Neuro\n Surgery, Orthopaedics, Pulmanology,\n Plastic Surgery.","2010-04-02","Life Line Hospitals, 2-4-152, Ram Nagar,\nHanmakonda, Warangal District.","2007-04-03","31212/LC-B/2006","Gen. Medicine, Gen. Surgery, ENT,\n OBG, Paediatrics, Neurology, Neuro\n Surgery, Orthopaedics, Pulmanology,\n Plastic Surgery.","2010-04-02"]
[null,209,"Lions District 324-C1, Cancer Treatment &\nResearch Centre, Seethammadhara (NE),\nVisakhapatnam - 530013.","3-Apr-2007","16867/LC-B/2006","Cancer","2-Apr-2010","Lions District 324-C1, Cancer Treatment &\nResearch Centre, Seethammadhara (NE),\nVisakhapatnam - 530013.","3-Apr-2007","16867/LC-B/2006","Cancer","2-Apr-2010"]
[null,210,"Lotus Children's Hospital, Lakdika Pool,\nHyderabad.","10-Aug-2007","11915/LC.B/2007","Pediatric Specialization","9-Aug-2010","Lotus Children's Hospital, Lakdika Pool,\nHyderabad.","10-Aug-2007","11915/LC.B/2007","Pediatric Specialization","9-Aug-2010"]
[null,211,"LV Prasad Eye Institute, Kallam Anji Reddy\nCampus, LV Prasad Marg, Banjara Hills,\nHyderabad","2-Jul-2010","10664/LC-B/2006","Ophthalmology","1-Jul-2013","LV Prasad Eye Institute, Kallam Anji Reddy\nCampus, LV Prasad Marg, Banjara Hills,\nHyderabad","2-Jul-2010","10664/LC-B/2006","Ophthalmology","1-Jul-2013"]
[null,212,"M.N.Hospitals, 4/10, Brodipet, Guntur","11-Jun-2010","8588/LC-B/2010","OBG","10-Jun-2013","M.N.Hospitals, 4/10, Brodipet, Guntur","11-Jun-2010","8588/LC-B/2010","OBG","10-Jun-2013"]
[null,213,"M.S. Multi Speciality Dental Hospital, 8-2-\n165/8, Wyra Road, Khammam","2006-05-06","2528/LC.B/2006","Dental","2012-05-06","M.S. Multi Speciality Dental Hospital, 8-2-\n165/8, Wyra Road, Khammam","2006-05-06","2528/LC.B/2006","Dental","2012-05-06"]
[null,214,"M.S.Hospital, Road No.1, Abbanna Colony,\nNear Tirumala By-pass Road, Tirupati, Chittor\nDist.","2-Jul-2010","5513/LC-B/2010","General Surgery","1-Jul-2013","M.S.Hospital, Road No.1, Abbanna Colony,\nNear Tirumala By-pass Road, Tirupati, Chittor\nDist.","2-Jul-2010","5513/LC-B/2010","General Surgery","1-Jul-2013"]
[null,215,"Madanapalli Hospitals Pvt. Ltd., Madanapalli,\nC.M.T. Road, Chittor Dist.","11-Jun-2010","47781/LC-B/2009","General Medicine, General Surgery,\n OBG, Orthopaedics and Paediatrics","10-Jun-2013","Madanapalli Hospitals Pvt. Ltd., Madanapalli,\nC.M.T. Road, Chittor Dist.","11-Jun-2010","47781/LC-B/2009","General Medicine, General Surgery,\n OBG, Orthopaedics and Paediatrics","10-Jun-2013"]
[null,216,"Madhava Nursing Home, 43, Sarojini Devi\nRoad, Secunderabad.","2006-11-10","21560/LC-B/2006","Multi","2012-11-09","Madhava Nursing Home, 43, Sarojini Devi\nRoad, Secunderabad.","2006-11-10","21560/LC-B/2006","Multi","2012-11-09"]
[null,217,"Madhu Chalapati Urological Hospital,\nJ.P.Road, Bhimavaram, West Godavary Dist.","2010-06-11","1609/LC-B/2010","Anaesthesiology, General Surgery,\n Urology, Surgical Gastroenterology,\n Neuro Surgery, Plastic Surgery, OBG,\n Paediatrics, ENT, Orthopaedics and\n Radiology","2013-06-10","Madhu Chalapati Urological Hospital,\nJ.P.Road, Bhimavaram, West Godavary Dist.","2010-06-11","1609/LC-B/2010","Anaesthesiology, General Surgery,\n Urology, Surgical Gastroenterology,\n Neuro Surgery, Plastic Surgery, OBG,\n Paediatrics, ENT, Orthopaedics and\n Radiology","2013-06-10"]
[null,218,"Madhukar Reddy Super Speciality Dental\nHospital, 5-7-87, Main Road, Lashkar Bazar,\nOpp. Petrol Pump, Hanamkonda, Warangal","2010-07-12","16765/LC-B/2010","Dental","2013-07-11","Madhukar Reddy Super Speciality Dental\nHospital, 5-7-87, Main Road, Lashkar Bazar,\nOpp. Petrol Pump, Hanamkonda, Warangal","2010-07-12","16765/LC-B/2010","Dental","2013-07-11"]
[null,219,"Madhumani Nursing Home, Balaji Complex,\nNandyal, Kurnool District.","1-Aug-2009","39378/LC-B/2008","ENT, OBG and Orthopaedics","31-Jul-2012","Madhumani Nursing Home, Balaji Complex,\nNandyal, Kurnool District.","1-Aug-2009","39378/LC-B/2008","ENT, OBG and Orthopaedics","31-Jul-2012"]
[null,220,"Madurai Netralaya, 16-02-280, Beside Market,\nGandhi Nagar, Pogathota, Nellore","9-Apr-2009","837/LC.B/2009","Ophthalmology","8-Apr-2012","Madurai Netralaya, 16-02-280, Beside Market,\nGandhi Nagar, Pogathota, Nellore","9-Apr-2009","837/LC.B/2009","Ophthalmology","8-Apr-2012"]
[null,221,"Mahatma Gandhi Super Speciality Hospitals,\n12-4-2, Prakashnagar, Narsaraopet, Guntur\nDist.","1-Dec-2009","34425/LC-B/2009","Cardiology","31-Nov-2012","Mahatma Gandhi Super Speciality Hospitals,\n12-4-2, Prakashnagar, Narsaraopet, Guntur\nDist.","1-Dec-2009","34425/LC-B/2009","Cardiology","31-Nov-2012"]
[null,222,"Mahavir Hospital & Research Centre, 10-1-1,\nBhagwan Mahavir Marg, A.C.Guards, Masab\nTank, Hyderabad","2010-07-02","3695/LC-B/2009","General Medicine, General Surgery,\n Cardiology, C.T.Surgery, OBG,\n Paediatrics, Orthopaedics, ENT,\n Anaesthesiology, Neuro Surgery,\n Radiology, Plastic Surgery, Urology,\n Nephrology, Pulmonologyand\n Pathology","2013-07-01","Mahavir Hospital & Research Centre, 10-1-1,\nBhagwan Mahavir Marg, A.C.Guards, Masab\nTank, Hyderabad","2010-07-02","3695/LC-B/2009","General Medicine, General Surgery,\n Cardiology, C.T.Surgery, OBG,\n Paediatrics, Orthopaedics, ENT,\n Anaesthesiology, Neuro Surgery,\n Radiology, Plastic Surgery, Urology,\n Nephrology, Pulmonologyand\n Pathology","2013-07-01"]
[null,223,"Mamatha General Hospital, 5-7-200, Giri\nPrasad Nagar, Urban Mandal, Khammam\nDist.","2006-07-22","1795/LC-B/2006","General Medicine, General Surgery,\n Anaesthesiology, OBG, Paediatrics,\n Orthopaedics, ENT, Urology, Neuro\n Surgery, Plastic Surgery and\n Pulmonology","2012-07-21","Mamatha General Hospital, 5-7-200, Giri\nPrasad Nagar, Urban Mandal, Khammam\nDist.","2006-07-22","1795/LC-B/2006","General Medicine, General Surgery,\n Anaesthesiology, OBG, Paediatrics,\n Orthopaedics, ENT, Urology, Neuro\n Surgery, Plastic Surgery and\n Pulmonology","2012-07-21"]
[null,224,"Manipal Super Speciality Hospital, Tadepally,\nGuntur Dist.","2008-11-06","4307/LC.B/2007","Cardiology, C.T. Surgery, Nephrology,\n Neuro Surgery, Orthopedics, Plastic\n Surgery, Medical Oncology and\n Surgical Gastroentorology.","2011-11-05","Manipal Super Speciality Hospital, Tadepally,\nGuntur Dist.","2008-11-06","4307/LC.B/2007","Cardiology, C.T. Surgery, Nephrology,\n Neuro Surgery, Orthopedics, Plastic\n Surgery, Medical Oncology and\n Surgical Gastroentorology.","2011-11-05"]
[null,225,"Manipal Women and Child Hospital, 18-1-3,\nK.G.Down, Maharanipet, Jagadamba Center,\nVisakhapatnam.","2009-03-21","12616/LC.B/2008","Genl. Medicine, General Surgery,\n Orthopedics, E.N.T., Neuro Surgery,\n OBG., Cardiology, Nephrology and\n Pediatrics","2012-03-20","Manipal Women and Child Hospital, 18-1-3,\nK.G.Down, Maharanipet, Jagadamba Center,\nVisakhapatnam.","2009-03-21","12616/LC.B/2008","Genl. Medicine, General Surgery,\n Orthopedics, E.N.T., Neuro Surgery,\n OBG., Cardiology, Nephrology and\n Pediatrics","2012-03-20"]
[null,226,"Manorama Hospital, Khaleelwadi,. Nizamabad","13-May-2009","8162/LC.B/2007","Anesthesiology, Gen. Med. Gen.\n Surgery, ENT, Urology, Radiology,\n OBG and Pediatrics","12-May-2012","Manorama Hospital, Khaleelwadi,. Nizamabad","13-May-2009","8162/LC.B/2007","Anesthesiology, Gen. Med. Gen.\n Surgery, ENT, Urology, Radiology,\n OBG and Pediatrics","12-May-2012"]
[null,227,"Maxivision Laser Centre Pvt. Ltd., 1-11-\n252/1A to 1D, Begumpet, Hyderabad","2006-06-09","12693/LC.B/2003","Ophthalmology","2012-06-08","Maxivision Laser Centre Pvt. Ltd., 1-11-\n252/1A to 1D, Begumpet, Hyderabad","2006-06-09","12693/LC.B/2003","Ophthalmology","2012-06-08"]
[null,228,"Medi Center Super SpecialtyHospital, 6-2-\n106/C, Ramagiri Road, Nalgonda.","2008-10-21","30997/LC.B/2007","Anaesthesiology, Cardiology, C.T.\n Surgery, E.N.T., Emergency Medicine,\n General Medicine, General Surgery,\n Nephrology, Neuro Surgery, OBG.,\n Orthopedics, Pediatrics, Pathology,\n Pulmanology, Radiology, Oncology,\n Urology, Physio Therapy and Dialysis\n Unit.","2011-10-20","Medi Center Super SpecialtyHospital, 6-2-\n106/C, Ramagiri Road, Nalgonda.","2008-10-21","30997/LC.B/2007","Anaesthesiology, Cardiology, C.T.\n Surgery, E.N.T., Emergency Medicine,\n General Medicine, General Surgery,\n Nephrology, Neuro Surgery, OBG.,\n Orthopedics, Pediatrics, Pathology,\n Pulmanology, Radiology, Oncology,\n Urology, Physio Therapy and Dialysis\n Unit.","2011-10-20"]
[null,229,"Medicare Hospitals, 74-11-7, New Prakash\nNagar Round Park, Prakashnagar,\nRajahmundry","2010-05-13","45944/LC-B/2009","General Medicine, General Surgery,\n Emergency Medicine, Cardiology, ENT,\n Nephrology, OBG, Orthopaedics,\n Paediatrics, Plastic Surgery,\n Pulmonology, Surgical\n Gastroentesrology, Urology and\n Physiotherapy","2013-05-12","Medicare Hospitals, 74-11-7, New Prakash\nNagar Round Park, Prakashnagar,\nRajahmundry","2010-05-13","45944/LC-B/2009","General Medicine, General Surgery,\n Emergency Medicine, Cardiology, ENT,\n Nephrology, OBG, Orthopaedics,\n Paediatrics, Plastic Surgery,\n Pulmonology, Surgical\n Gastroentesrology, Urology and\n Physiotherapy","2013-05-12"]
[null,230,"Medicare Multi Speciality Hospital, 25/466,\nNear RTC Bus Stand, Nandyal, Kurnool Dist.","29-Jul-2010","10188/LC-B/2010","General Medicine, General Surgery,\n ENT, Urology, Orthopaedics and\n Trauma Care","28-Jul-2013","Medicare Multi Speciality Hospital, 25/466,\nNear RTC Bus Stand, Nandyal, Kurnool Dist.","29-Jul-2010","10188/LC-B/2010","General Medicine, General Surgery,\n ENT, Urology, Orthopaedics and\n Trauma Care","28-Jul-2013"]
[null,231,"Mediciti Hospital, 5-9-22, Secretariat Raod,\nSarovar Complex, Hyderabad - 500063.","2006-11-10","18816/LC-B/2005","Anaesthesiology, General Medicine,\n General Surgery, ENT, Emergency\n Medicine, Cardiology, C.T.Surgery,\n OBG, Nephrology, Neuro Surgery,\n Orthopaedics, Pathology, Plastic\n Surgery, Pulmonology, Radiology,\n Urology, Physiotherapy and Dialysis\n Unit","2012-11-09","Mediciti Hospital, 5-9-22, Secretariat Raod,\nSarovar Complex, Hyderabad - 500063.","2006-11-10","18816/LC-B/2005","Anaesthesiology, General Medicine,\n General Surgery, ENT, Emergency\n Medicine, Cardiology, C.T.Surgery,\n OBG, Nephrology, Neuro Surgery,\n Orthopaedics, Pathology, Plastic\n Surgery, Pulmonology, Radiology,\n Urology, Physiotherapy and Dialysis\n Unit","2012-11-09"]
[null,232,"Medivision Eye and Health Care Center, Indira\nSadan, Humayun Nagar Main Road,\nHyderabad.","6-Nov-2007","19013/LC.B/2006","Ophthalmology","5-Nov-2010","Medivision Eye and Health Care Center, Indira\nSadan, Humayun Nagar Main Road,\nHyderabad.","6-Nov-2007","19013/LC.B/2006","Ophthalmology","5-Nov-2010"]
[null,233,"Medwin General Hospital, Mankamma Thota,\nKarimnagar.","2006-12-29","12346/LC-B/2006","General Medicine, General Surgery,\n OBG, Orthopaedsics, Plastic Surgery,\n Surgical Oncology, Neuro Surgery and\n Urology","2012-12-28","Medwin General Hospital, Mankamma Thota,\nKarimnagar.","2006-12-29","12346/LC-B/2006","General Medicine, General Surgery,\n OBG, Orthopaedsics, Plastic Surgery,\n Surgical Oncology, Neuro Surgery and\n Urology","2012-12-28"]
[null,234,"Medwin Hospitals, Raghava Ratna Towers,\nChirag Ali Lane, Nampally, Hyderabad","2006-05-06","18527/LC.B/2005","General Medicine, General Surgery,\n Anaesthesiology, Emergency\n Medicine, Cardiology, C.T.Surgery,\n Paediatrics, Orthopaedics, ENT,\n Urology, Neuro Surgery, Plastic\n Surgery, Nephrology, OBG, Pathology,\n Pulmonology, Radiology, Surgical\n Gastroenterology and Dialysis Unit","2012-05-05","Medwin Hospitals, Raghava Ratna Towers,\nChirag Ali Lane, Nampally, Hyderabad","2006-05-06","18527/LC.B/2005","General Medicine, General Surgery,\n Anaesthesiology, Emergency\n Medicine, Cardiology, C.T.Surgery,\n Paediatrics, Orthopaedics, ENT,\n Urology, Neuro Surgery, Plastic\n Surgery, Nephrology, OBG, Pathology,\n Pulmonology, Radiology, Surgical\n Gastroenterology and Dialysis Unit","2012-05-05"]
[null,235,"Meena Hospital, Sai Ranga Towers,\nThukaram Gate, North Lallaguda,\nSecunderabad -17.","29-Dec-2006","6886/LC-B/2005","General Medicine, General Surgery,\n OBG, ENT and Urology","28-Dec-2009","Meena Hospital, Sai Ranga Towers,\nThukaram Gate, North Lallaguda,\nSecunderabad -17.","29-Dec-2006","6886/LC-B/2005","General Medicine, General Surgery,\n OBG, ENT and Urology","28-Dec-2009"]
[null,236,"MNR Medical College & Hospital, Fasalwadi,\nSangareddy, Medak District.","2007-02-17","6753/LC-B/2002","Anesthesiology, General Medicine,\n General Surgery, ENT,Obst &\n Gynecology, Orthopedics, Pediatrics\n and Radiology","2010-02-16","MNR Medical College & Hospital, Fasalwadi,\nSangareddy, Medak District.","2007-02-17","6753/LC-B/2002","Anesthesiology, General Medicine,\n General Surgery, ENT,Obst &\n Gynecology, Orthopedics, Pediatrics\n and Radiology","2010-02-16"]
[null,237,"Modern Eye Hospital, & Research Centre 16-\n11-101, Beside Venkataramana Hotel Lane\nPogathota, Nellore - 524 001","2006-06-09","7890/LC.B/2005","Ophthalmology","2012-06-08","Modern Eye Hospital, & Research Centre 16-\n11-101, Beside Venkataramana Hotel Lane\nPogathota, Nellore - 524 001","2006-06-09","7890/LC.B/2005","Ophthalmology","2012-06-08"]
[null,238,"Modern Retina Centre, 29-27-5, Kaleswara\nRao Road, Lane to SBI Zonal Office,\nSurayaraopet, Vijayawada","27-Mar-2010","34481/LC-B/2009","Ophthalmology","26-Mar-2013","Modern Retina Centre, 29-27-5, Kaleswara\nRao Road, Lane to SBI Zonal Office,\nSurayaraopet, Vijayawada","27-Mar-2010","34481/LC-B/2009","Ophthalmology","26-Mar-2013"]
[null,239,"MVS Accident Hospital, Near Pushpa Hotel,\nSuryaraopet, Vijayawada","2006-06-09","12566/LC.B/2005","Orthopedics","2012-06-08","MVS Accident Hospital, Near Pushpa Hotel,\nSuryaraopet, Vijayawada","2006-06-09","12566/LC.B/2005","Orthopedics","2012-06-08"]
[null,240,"Mythri Hospital, 13-6-434/C/148, Near PVNR\nAirport Flyover Pillar No.80, Mehidipatnam,\nHyderabad","2009-11-09","27662/LC-B/2009","Anaesthesiology, Cardiology,\n C.T.Surgery, ENT, Emergency\n Medicine, General Medicine, General\n Surgery, Nephrology, Neuro Surgery,\n Nuclear Medicine, OBG, Paediatrics,\n Pathology, Plastic Surgery,\n Pulmonology, Radiology, Surgical\n Gastroenterology, Susrgical Oncology,\n Urology, Physiotherapy and Dialysis\n Unit","2012-11-09","Mythri Hospital, 13-6-434/C/148, Near PVNR\nAirport Flyover Pillar No.80, Mehidipatnam,\nHyderabad","2009-11-09","27662/LC-B/2009","Anaesthesiology, Cardiology,\n C.T.Surgery, ENT, Emergency\n Medicine, General Medicine, General\n Surgery, Nephrology, Neuro Surgery,\n Nuclear Medicine, OBG, Paediatrics,\n Pathology, Plastic Surgery,\n Pulmonology, Radiology, Surgical\n Gastroenterology, Susrgical Oncology,\n Urology, Physiotherapy and Dialysis\n Unit","2012-11-09"]
[null,241,"Mythri Hospital, Chanda Nagar, Hyd.","2008-07-03","43987/LC.B/2007","Genl. Medicine, Genl. Surgery,\n Anesthesiology, Cardiology, C.T.\n Surgery, ENT., Emergency Medicine,\n Nephrology, Neuro Surgery, Nuclear\n Medicine, OBG., Orthopedics,\n Pediatrics, Pathology, Plastic Surgery,\n Pulmonology, Radiology, Oncology,\n Uronology and Physiotherapy","2011-07-02","Mythri Hospital, Chanda Nagar, Hyd.","2008-07-03","43987/LC.B/2007","Genl. Medicine, Genl. Surgery,\n Anesthesiology, Cardiology, C.T.\n Surgery, ENT., Emergency Medicine,\n Nephrology, Neuro Surgery, Nuclear\n Medicine, OBG., Orthopedics,\n Pediatrics, Pathology, Plastic Surgery,\n Pulmonology, Radiology, Oncology,\n Uronology and Physiotherapy","2011-07-02"]
[null,242,"Mythri Hospital, D.No. 15-721, Kamalanagar,\nAnantapur","22-Jan-2010","27032/LC-B/2009","General Medicine, General Surgery,\n OBG, Orthopaedics and Urology","21-Jan-2013","Mythri Hospital, D.No. 15-721, Kamalanagar,\nAnantapur","22-Jan-2010","27032/LC-B/2009","General Medicine, General Surgery,\n OBG, Orthopaedics and Urology","21-Jan-2013"]
[null,243,"Mythri Multi Speciality Hospital, 15-8-18,\nRamakumari Vari Veedhi, Santhampesta,\nOngole, Prakasam Dist.","11-Jun-2010","35708/LC-B/2010","General Medicine, General Surgery,\n Urology, Orthopaedics, OBG,\n Paediatrics and Physiotherapy","10-Jun-2013","Mythri Multi Speciality Hospital, 15-8-18,\nRamakumari Vari Veedhi, Santhampesta,\nOngole, Prakasam Dist.","11-Jun-2010","35708/LC-B/2010","General Medicine, General Surgery,\n Urology, Orthopaedics, OBG,\n Paediatrics and Physiotherapy","10-Jun-2013"]
[null,244,"Mythri Multi Speciality Hospitals, Ameerpet,\nHyderabad","3-Feb-2006","18486/LC-B/2005","Multi","2-Feb-2009","Mythri Multi Speciality Hospitals, Ameerpet,\nHyderabad","3-Feb-2006","18486/LC-B/2005","Multi","2-Feb-2009"]
[null,245,"N. N. Speciality Dental Hospital, N.H. 7,\nTirumala Theatre Road, Nirmal, Adilabad.","26-Apr-2007","21224/LC-B/2006","Dental","25-Apr-2010","N. N. Speciality Dental Hospital, N.H. 7,\nTirumala Theatre Road, Nirmal, Adilabad.","26-Apr-2007","21224/LC-B/2006","Dental","25-Apr-2010"]
[null,246,"Nagabandi Multi SpecialtyDental Hospital, 11-\n3-91/7, Balaji Nagar, Wyra Road, Khammam.","30-Apr-2008","35577/LC.B/2007","Dental","29-Apr-2011","Nagabandi Multi SpecialtyDental Hospital, 11-\n3-91/7, Balaji Nagar, Wyra Road, Khammam.","30-Apr-2008","35577/LC.B/2007","Dental","29-Apr-2011"]
[null,247,"Nagarjuna Hospitals, Kanuru, Vijayawada-7","2006-01-03","18474/LC-B/2005","Multi","2012-01-02","Nagarjuna Hospitals, Kanuru, Vijayawada-7","2006-01-03","18474/LC-B/2005","Multi","2012-01-02"]
[null,248,"Nalluri Nursing Home, Kothapatnam Road,\nOngole, Prakasham Dist.","2008-08-13","12786/LC.B/2007","Genl. Medicine, Genl. Surgey, OBG.,\n ENT., Orthopedics, Pediatrics,\n Anaesthesiology, Surgical Oncology,\n Plastic Surgery and Neuro Surgery.","2011-08-12","Nalluri Nursing Home, Kothapatnam Road,\nOngole, Prakasham Dist.","2008-08-13","12786/LC.B/2007","Genl. Medicine, Genl. Surgey, OBG.,\n ENT., Orthopedics, Pediatrics,\n Anaesthesiology, Surgical Oncology,\n Plastic Surgery and Neuro Surgery.","2011-08-12"]
[null,249,"Narayana Dental College and Hospital,\nNellore","11-Jan-2008","704/LC.B/2007","Dental","10-Jan-2011","Narayana Dental College and Hospital,\nNellore","11-Jan-2008","704/LC.B/2007","Dental","10-Jan-2011"]
[null,250,"Narayana Hrudayalaya, 1-1-216, Suraram 'X'\nRoads, Jeedimetla, Hyderabad","2010-07-30","14993/LC-B/2010","General Medicine, General Surgery,\n Cardiology, C.T.Surgery, Neuro\n Surgery, Nephrology, Urology, Surgical\n Gastroentesrology, Plastic Surgery,\n Paediatrics, Pulmonology, OBG, ENT\n and Orthopaedics & Trauma Care","2013-07-29","Narayana Hrudayalaya, 1-1-216, Suraram 'X'\nRoads, Jeedimetla, Hyderabad","2010-07-30","14993/LC-B/2010","General Medicine, General Surgery,\n Cardiology, C.T.Surgery, Neuro\n Surgery, Nephrology, Urology, Surgical\n Gastroentesrology, Plastic Surgery,\n Paediatrics, Pulmonology, OBG, ENT\n and Orthopaedics & Trauma Care","2013-07-29"]
[null,251,"Narayana Hrudayalaya. Pvt. Ltd. 258/A,\nBommasandra Industrial Area, Bangalore","24-Jul-2009","4855/LC-B/2008","Multi Spescialisation","23-Jul-2012","Narayana Hrudayalaya. Pvt. Ltd. 258/A,\nBommasandra Industrial Area, Bangalore","24-Jul-2009","4855/LC-B/2008","Multi Spescialisation","23-Jul-2012"]
[null,252,"Narayana Medical College and Hospital,\nChinta Reddy Palem, Nellore","2007-05-22","705/LC.B/2007","Anesthesiology, ENT, General\n Medicine, General Surgery, Obst &\n Gynecology, Orthopedics, Pediatrics &\n Radiology, Neuclear Medicine,\n Pathology, Plastic Surgery,\n Pulmanology, Physiotherapy and\n Dialysis Unit, Emergency Medicine,\n Cardiology, C.T. Surgery, Nephrology,\n Neuro Surgeryand Urology","2010-05-21","Narayana Medical College and Hospital,\nChinta Reddy Palem, Nellore","2007-05-22","705/LC.B/2007","Anesthesiology, ENT, General\n Medicine, General Surgery, Obst &\n Gynecology, Orthopedics, Pediatrics &\n Radiology, Neuclear Medicine,\n Pathology, Plastic Surgery,\n Pulmanology, Physiotherapy and\n Dialysis Unit, Emergency Medicine,\n Cardiology, C.T. Surgery, Nephrology,\n Neuro Surgeryand Urology","2010-05-21"]
[null,253,"Navata Multi Speciality Dental Care Center, 5-\n6-224, Saraswathi Nagar, Opp. RDO Office,\nNizamabad.","2006-07-22","9501/LC-B/2005","Dental","2012-07-22","Navata Multi Speciality Dental Care Center, 5-\n6-224, Saraswathi Nagar, Opp. RDO Office,\nNizamabad.","2006-07-22","9501/LC-B/2005","Dental","2012-07-22"]
[null,254,"Naveen Chandra Dental Clinic Railway\nStation Road, Rajampeta, Kadapa Dist.","26-Mar-2010","44911/LC-B/2009","Dental","25-Mar-2013","Naveen Chandra Dental Clinic Railway\nStation Road, Rajampeta, Kadapa Dist.","26-Mar-2010","44911/LC-B/2009","Dental","25-Mar-2013"]
[null,255,"Naveen Dental Hospital, 151-A, Sri Ram\nStreet, Tirupthi.","2007-04-24","19499/LC-B/2006","Dental","2013-04-23","Naveen Dental Hospital, 151-A, Sri Ram\nStreet, Tirupthi.","2007-04-24","19499/LC-B/2006","Dental","2013-04-23"]
[null,256,"Navya Nethralaya 2-2-349, K.V. Layout, (Near\nLIC Office) Tirupathi","2006-06-09","11566/LC.B/2005","Ophthalmology","2012-06-08","Navya Nethralaya 2-2-349, K.V. Layout, (Near\nLIC Office) Tirupathi","2006-06-09","11566/LC.B/2005","Ophthalmology","2012-06-08"]
[null,257,"Nayana Eye Care, 3-1-50, Srinagar,\nBhanugudi Junction, Kakinada",{"$f":"I259","v":"25-May-2009"},{"$f":"J259","v":"45163/LC.B/2008"},{"$f":"K259","v":"Ophthalmology"},{"$f":"L259","v":"24-May-2012"},"Nayana Eye Care, 3-1-50, Srinagar,\nBhanugudi Junction, Kakinada","25-May-2009","45163/LC.B/2008","Ophthalmology","24-May-2012"]
[null,258,"Neoretina Eye Care Institute, 5-9-83/B, Chapel\nRoad, Lane Opp. L.B.Stadium, Nampally,\nAbids, Hyderabad","30-Jul-2010","22506/LC-B/2010","Ophthalmology ( for Anterior and\n Posterior Segment diseases of Eye)","29-Jul-2013","Neoretina Eye Care Institute, 5-9-83/B, Chapel\nRoad, Lane Opp. L.B.Stadium, Nampally,\nAbids, Hyderabad","30-Jul-2010","22506/LC-B/2010","Ophthalmology ( for Anterior and\n Posterior Segment diseases of Eye)","29-Jul-2013"]
[null,259,"New Life Emergesncy & Multi Speciality\nHospital, NST Road, Khammam","2008-04-29","11022/LC-B/2008","General Medicine, General Surgery,\n Cardiology, Neuro Surgery,\n Orthopaedics, Pulmonology,\n Paediatrics, OBG, ENT, Urology,\n Radiology, Physiotherapy, Pathology,\n Anaesthesiology, and Plastic Surgery","2011-04-28","New Life Emergesncy & Multi Speciality\nHospital, NST Road, Khammam","2008-04-29","11022/LC-B/2008","General Medicine, General Surgery,\n Cardiology, Neuro Surgery,\n Orthopaedics, Pulmonology,\n Paediatrics, OBG, ENT, Urology,\n Radiology, Physiotherapy, Pathology,\n Anaesthesiology, and Plastic Surgery","2011-04-28"]
[null,260,"New Life Hospital, Kamal Theatre Complex,\nChaderghat, Hyderabad.","2005-11-16","18350/LC-B/2005","Multi","2011-11-15","New Life Hospital, Kamal Theatre Complex,\nChaderghat, Hyderabad.","2005-11-16","18350/LC-B/2005","Multi","2011-11-15"]
[null,261,"Nightingale Hospital, 17-1-383/N.S/3 & 4,\nOpp. Amber Biscult Factory, Nagarjuna Sagar\nRoad, Hyderabad.","2006-09-11","14164/LC-B/2006","Multi","2012-09-10","Nightingale Hospital, 17-1-383/N.S/3 & 4,\nOpp. Amber Biscult Factory, Nagarjuna Sagar\nRoad, Hyderabad.","2006-09-11","14164/LC-B/2006","Multi","2012-09-10"]
[null,262,"Nihar Orthopedics and Multi Speciality\nHospital, 8-3-214/2, Murthy Mansion,\nSrinivasa Nagar, Ameerpet, Hyderabad.","18-Apr-2008","24754/LC.B/2006","Orhopedics","17-Apr-2011","Nihar Orthopedics and Multi Speciality\nHospital, 8-3-214/2, Murthy Mansion,\nSrinivasa Nagar, Ameerpet, Hyderabad.","18-Apr-2008","24754/LC.B/2006","Orhopedics","17-Apr-2011"]
[null,263,"Nirmala Maternity, Orthopedic and General\nHospital, 2/3 R.T. Opp. Post Office,\nVijayanagar Colony, Hyderabad.","20-Mar-2009","16039/LC.B/2007","Orthopedics.","19-Mar-2012","Nirmala Maternity, Orthopedic and General\nHospital, 2/3 R.T. Opp. Post Office,\nVijayanagar Colony, Hyderabad.","20-Mar-2009","16039/LC.B/2007","Orthopedics.","19-Mar-2012"]
[null,264,"Nizamabad Super Specialty Dental Hospital, 5-\n6-798, 799 - Khaleelwadi, Nizamabad.","18-Apr-2008","16129/LC.B/2007","Dental","17-Apr-2011","Nizamabad Super Specialty Dental Hospital, 5-\n6-798, 799 - Khaleelwadi, Nizamabad.","18-Apr-2008","16129/LC.B/2007","Dental","17-Apr-2011"]
[null,265,"NRI General Hospital, Chinakakani, Guntur\nDistrict.","2006-08-10","9952/LC-B/2006","Anaesthesiology, General Medicine,\n General Surgery, OBG, Paediatrics,\n Orthopaediatrics, ENT, Radiology,\n Cardiology, C.T.surgery, Neuro\n Surgery, Surgical Gastroenterology,\n Nephrology, Plastic Surgery, Urology\n and Physiotherapy","2012-08-09","NRI General Hospital, Chinakakani, Guntur\nDistrict.","2006-08-10","9952/LC-B/2006","Anaesthesiology, General Medicine,\n General Surgery, OBG, Paediatrics,\n Orthopaediatrics, ENT, Radiology,\n Cardiology, C.T.surgery, Neuro\n Surgery, Surgical Gastroenterology,\n Nephrology, Plastic Surgery, Urology\n and Physiotherapy","2012-08-09"]
[null,266,"Omni Hospitals, Opp. P.V.T. Market\nKothapest 'X' Road, Dilsukhnagar Hyderabad","2010-08-07","24607/LC-B/2010","General Medicine, General Surgery,\n Anaesthesiology, Cardiology,\n C.T.Surgery, ENT, Nephrology, Neuro\n Surgery, OBG, Orthopaedics,\n Nephrology, Paediatrics, Pathology,\n Plastic Surgesry, Pulmonology,\n Radiology, Surgical Oncology, Urology,\n Physiotherapy and Dialysis Unit","2013-08-06","Omni Hospitals, Opp. P.V.T. Market\nKothapest 'X' Road, Dilsukhnagar Hyderabad","2010-08-07","24607/LC-B/2010","General Medicine, General Surgery,\n Anaesthesiology, Cardiology,\n C.T.Surgery, ENT, Nephrology, Neuro\n Surgery, OBG, Orthopaedics,\n Nephrology, Paediatrics, Pathology,\n Plastic Surgesry, Pulmonology,\n Radiology, Surgical Oncology, Urology,\n Physiotherapy and Dialysis Unit","2013-08-06"]
[null,267,"Padma Chandra Super Specialty Hospital,\nOpp. Government Medical College,\nBudhawarpet, Kurnool.","2006-12-29","18635/LC-B/2006","General Medicine, General Surgery,\n Anaesthesiology, Cardiology,\n C.T.Surgery, ENT, Emergency\n Medicine, Nephrology, Neuro Surgery,\n OBG, Orthopaedsics, Paediatrics,\n Pathology, Plastic Surgery,\n Pulmonology, Radiology, Surgical\n Gastroenterology, Surgical Oncology,\n Urology, Physiotherapy and Dialysis","2012-12-28","Padma Chandra Super Specialty Hospital,\nOpp. Government Medical College,\nBudhawarpet, Kurnool.","2006-12-29","18635/LC-B/2006","General Medicine, General Surgery,\n Anaesthesiology, Cardiology,\n C.T.Surgery, ENT, Emergency\n Medicine, Nephrology, Neuro Surgery,\n OBG, Orthopaedsics, Paediatrics,\n Pathology, Plastic Surgery,\n Pulmonology, Radiology, Surgical\n Gastroenterology, Surgical Oncology,\n Urology, Physiotherapy and Dialysis","2012-12-28"]
[null,268,"Padmachandra Super Speciality Hospital,\nOpp. Government Medical College,\nBudhawarapet, Kurnool","08-Dec-2009","41743/LC-B/2009","Ophthalmology","07-Dec-2012","Padmachandra Super Speciality Hospital,\nOpp. Government Medical College,\nBudhawarapet, Kurnool","08-Dec-2009","41743/LC-B/2009","Ophthalmology","07-Dec-2012"]
[null,269,"Park Health Care, 6-3-903/A and B,\nSomajiguda, Hyderabad","2010-01-05","43528/LC-B/2009","General Medicine, General Surgery,\n OBG, ENT, Anaesthesiology,\n Orthopaedics, Emergency Medicine,\n Nephrology, Neuro Surgery, Pathology,\n Plastic Surgery, Radiology,\n Pulmonology, Surgical\n Gastroentesrology, Urology,\n Physiotherapy and Dialysis Unit","2013-01-04","Park Health Care, 6-3-903/A and B,\nSomajiguda, Hyderabad","2010-01-05","43528/LC-B/2009","General Medicine, General Surgery,\n OBG, ENT, Anaesthesiology,\n Orthopaedics, Emergency Medicine,\n Nephrology, Neuro Surgery, Pathology,\n Plastic Surgery, Radiology,\n Pulmonology, Surgical\n Gastroentesrology, Urology,\n Physiotherapy and Dialysis Unit","2013-01-04"]
[null,270,"Partha Dental Hospital & Research Centre,\n600/44/77, P.K. Layout,Tirupathi.","2006-05-06","15100/LC.B/2005","Dental","2012-05-05","Partha Dental Hospital & Research Centre,\n600/44/77, P.K. Layout,Tirupathi.","2006-05-06","15100/LC.B/2005","Dental","2012-05-05"]
[null,271,"Partha Dental Hospital & Research Centre,\nRama Talkies Circle , Viskhapatanam","27-Jul-2007","13199/LC-B/2007","Dental","26-Jul-2010","Partha Dental Hospital & Research Centre,\nRama Talkies Circle , Viskhapatanam","27-Jul-2007","13199/LC-B/2007","Dental","26-Jul-2010"]
[null,272,"Partha Dental Hospital and Research Center,\nNext to T.T.D. Kalyanamandapam, Liberty\nCenter, Hinayathnagar, Hyd.","18-Apr-2008","17569/LC.B/2007","Dental","17-Apr-2011","Partha Dental Hospital and Research Center,\nNext to T.T.D. Kalyanamandapam, Liberty\nCenter, Hinayathnagar, Hyd.","18-Apr-2008","17569/LC.B/2007","Dental","17-Apr-2011"]
[null,273,"Paruchuri Super SpecialtyDental Hospital,\nWyra Road, Khammam","4-Jan-2008","34129/LC.B/2007","Dental","3-Jan-2011","Paruchuri Super SpecialtyDental Hospital,\nWyra Road, Khammam","4-Jan-2008","34129/LC.B/2007","Dental","3-Jan-2011"]
[null,274,"Pavani Eye Hospital and YAG Laser Center,\nAshoknagar, Jagityal, Karimnagar","16-Dec-2008","26850/LC.B/2008","Ophthalmology","15-Dec-2011","Pavani Eye Hospital and YAG Laser Center,\nAshoknagar, Jagityal, Karimnagar","16-Dec-2008","26850/LC.B/2008","Ophthalmology","15-Dec-2011"]
[null,275,"Pinnamaneni Care Hospital, Siddhartha\nNagar, Vijayawada","6-Apr-2006","17882/LC-B/2005","Multi","5-Apr-2009","Pinnamaneni Care Hospital, Siddhartha\nNagar, Vijayawada","6-Apr-2006","17882/LC-B/2005","Multi","5-Apr-2009"]
[null,276,"Positive Dental Sciesnces Pvt.Ltd., HIG 203,\nDharamareddy Colony, MRO Office, KPHB,\nHyderabad","24-May-2010","12948/LC-B/2009","Dental","23-May-2013","Positive Dental Sciesnces Pvt.Ltd., HIG 203,\nDharamareddy Colony, MRO Office, KPHB,\nHyderabad","24-May-2010","12948/LC-B/2009","Dental","23-May-2013"]
[null,277,"Poulomi Hospital, Rukminipuri Colony, Dr.\nA.S. Rao Nagar, Main Road, Secunderabad.","2005-10-24","24693/LC-B/2005","General Medicine, General Surgery,\n Anaesthesiology, Orthopaedics,\n Cardiology, C.T.Surgery, ENT,\n Emergency Medicine, Nephrology,\n Neuro Suegery, OBG, Plastic Surgery,\n Pulmonology, Radiology, Surgical\n Gastroenterology, Surgical Oncology,\n Urology, Physiotherapy","2011-10-23","Poulomi Hospital, Rukminipuri Colony, Dr.\nA.S. Rao Nagar, Main Road, Secunderabad.","2005-10-24","24693/LC-B/2005","General Medicine, General Surgery,\n Anaesthesiology, Orthopaedics,\n Cardiology, C.T.Surgery, ENT,\n Emergency Medicine, Nephrology,\n Neuro Suegery, OBG, Plastic Surgery,\n Pulmonology, Radiology, Surgical\n Gastroenterology, Surgical Oncology,\n Urology, Physiotherapy","2011-10-23"]
[null,278,"Pragati Hospital, Hyderabad Road,\nNizamabad.","2009-05-02","12870/LC.B/2006","Anaesthesiology, Cardiology, E.N.T.,\n Genl. Medicine, Genl. Surgery,\n Nephrology, Neuro Surgery, OBG.,\n Orthopedics, Pediatrics, Pathology,\n Radiology, Urology, Physiotherapy, and\n Dialysis Unit.","2012-05-01","Pragati Hospital, Hyderabad Road,\nNizamabad.","2009-05-02","12870/LC.B/2006","Anaesthesiology, Cardiology, E.N.T.,\n Genl. Medicine, Genl. Surgery,\n Nephrology, Neuro Surgery, OBG.,\n Orthopedics, Pediatrics, Pathology,\n Radiology, Urology, Physiotherapy, and\n Dialysis Unit.","2012-05-01"]
[null,279,"Pragna Children's Hospital, 6-3-347/22/B/1,\nDwarkapuri Colony, Near Sai Baba Temple,\nPunjagutta, Hyderabad","2006-06-09","3990/LC.B/2005","Pedeatric Specialization","2012-06-08","Pragna Children's Hospital, 6-3-347/22/B/1,\nDwarkapuri Colony, Near Sai Baba Temple,\nPunjagutta, Hyderabad","2006-06-09","3990/LC.B/2005","Pedeatric Specialization","2012-06-08"]
[null,280,"Prakash Speciality Dental Clinic, D.No. 18/18,\n60 feet Road, Near RTC Bus Stand, Guntakal,\nAnantapur","30-Jul-2010","27848/LC-B/2009","Dental","29-Jul-2013","Prakash Speciality Dental Clinic, D.No. 18/18,\n60 feet Road, Near RTC Bus Stand, Guntakal,\nAnantapur","30-Jul-2010","27848/LC-B/2009","Dental","29-Jul-2013"]
[null,281,"Pramoda Hospital, 1-8-283, Beside Canara\nBank, Near Ekasila Park, Balasamudram,\nHanamkonda, Warangal","2010-08-07","48623/LC-B/2010","General Medicine, General Surgery,\n ENT, Paediatrics, Orthopaedics,\n Urology, Neuro Surgery, Plastic\n Surgery and Surgical Oncology","2013-08-06","Pramoda Hospital, 1-8-283, Beside Canara\nBank, Near Ekasila Park, Balasamudram,\nHanamkonda, Warangal","2010-08-07","48623/LC-B/2010","General Medicine, General Surgery,\n ENT, Paediatrics, Orthopaedics,\n Urology, Neuro Surgery, Plastic\n Surgery and Surgical Oncology","2013-08-06"]
[null,282,"Prasad Hospital, MIG-204, Road No.1, Opp.\nSitara Hotel, KPHB Colony, Hyderabad","2010-07-30","46112/LC-B/2009","General Medicine, General Surgery,\n Anaesthesiology, Cardiology, ENT,\n Emergency Medicine, OBG,\n Paediatrics, Orthopaedics, Pathology,\n Plastic Surgery, Nephrology, Neuro\n Surgery, Pulmonology, Radiology,\n Urology, Physiotherapy and Dialysis\n Unit","2013-07-29","Prasad Hospital, MIG-204, Road No.1, Opp.\nSitara Hotel, KPHB Colony, Hyderabad","2010-07-30","46112/LC-B/2009","General Medicine, General Surgery,\n Anaesthesiology, Cardiology, ENT,\n Emergency Medicine, OBG,\n Paediatrics, Orthopaedics, Pathology,\n Plastic Surgery, Nephrology, Neuro\n Surgery, Pulmonology, Radiology,\n Urology, Physiotherapy and Dialysis\n Unit","2013-07-29"]
[null,283,"Prasad Multi Speciality Hospital, Near Nellore\nBus Stand, Santhapet, Ongoole, Prakasam\nDistrict","29-Jul-2010","19611/LC-B/2010","General Medicine, General Surgery,\n Anaesthesiology, OBG, Paediatrics\n and Orthopaedics","28-Jul-2013","Prasad Multi Speciality Hospital, Near Nellore\nBus Stand, Santhapet, Ongoole, Prakasam\nDistrict","29-Jul-2010","19611/LC-B/2010","General Medicine, General Surgery,\n Anaesthesiology, OBG, Paediatrics\n and Orthopaedics","28-Jul-2013"]
[null,284,"Prashanth Hospital, APSEB City Central, Off.\nM.G.Road, Labbipet, Vijayawada","08-Dec-2009","37235/LC-B/2007","Urology, OBG, General Medicine,\n General Surgery and Surgical\n Gastroenterology","07-Dec-2012","Prashanth Hospital, APSEB City Central, Off.\nM.G.Road, Labbipet, Vijayawada","08-Dec-2009","37235/LC-B/2007","Urology, OBG, General Medicine,\n General Surgery and Surgical\n Gastroenterology","07-Dec-2012"]
[null,285,"Prathima Institute of Medical Sciences,\nNaganoor Road, Karimnagar","2009-02-18","23031/LC.B/2008","General Medicine, Genl. Surgery,\n Pediatrics, Orthopedics, E.N.T.,\n Pulmanology, OBG., Anaesthesiology,\n Cardiology, Neuro Surgery, Gastro\n Enterology and Urology","2012-02-17","Prathima Institute of Medical Sciences,\nNaganoor Road, Karimnagar","2009-02-18","23031/LC.B/2008","General Medicine, Genl. Surgery,\n Pediatrics, Orthopedics, E.N.T.,\n Pulmanology, OBG., Anaesthesiology,\n Cardiology, Neuro Surgery, Gastro\n Enterology and Urology","2012-02-17"]
[null,286,"Praveen Cardiac Centre, H.No. 33-25-35/C,\nPushpa Hotel Road, Kasturibaipet, Bellapu\nsobhanadri Street, Vijayawada","24-Oct-2009","36569/LC-B/2009","Cardiology","23-Oct-2012","Praveen Cardiac Centre, H.No. 33-25-35/C,\nPushpa Hotel Road, Kasturibaipet, Bellapu\nsobhanadri Street, Vijayawada","24-Oct-2009","36569/LC-B/2009","Cardiology","23-Oct-2012"]
[null,287,"Preethi Nursing Home, S.L.V. Talkies Road,\nGuntakal, Ananthapur Dist.","2009-05-02","45133/LC.B/2008","Genl. Medicine, Genl. Surgery, OBG.,\n Pediatricts, Orthopedics,\n Anaesthesiology, Radiology,\n Pathology, and Physiotherapy.","2012-05-01","Preethi Nursing Home, S.L.V. Talkies Road,\nGuntakal, Ananthapur Dist.","2009-05-02","45133/LC.B/2008","Genl. Medicine, Genl. Surgery, OBG.,\n Pediatricts, Orthopedics,\n Anaesthesiology, Radiology,\n Pathology, and Physiotherapy.","2012-05-01"]
[null,288,"Premier Hospitals, 1-2-718, Nanal Nagar 'X'\nRoads, Mehidipatnam, Hyderabad.","2006-01-03","18475/LC-B/2005","Anaesthesiology, CardiologyC.T.Surgery, ENT, Emergency\n Medicine, General Medicine, General\n Surgery, Nephrology, Neuro Surgery,\n OBG, Orthopaedics, Paediatrics,\n Pathology, Plastic Surgery,\n Pulmonology, Radiology, Urology,\n Surgical Gastroentesrology, Surgical\n Oncology, Urology and Physiotherapy","2012-01-02","Premier Hospitals, 1-2-718, Nanal Nagar 'X'\nRoads, Mehidipatnam, Hyderabad.","2006-01-03","18475/LC-B/2005","Anaesthesiology, CardiologyC.T.Surgery, ENT, Emergency\n Medicine, General Medicine, General\n Surgery, Nephrology, Neuro Surgery,\n OBG, Orthopaedics, Paediatrics,\n Pathology, Plastic Surgery,\n Pulmonology, Radiology, Urology,\n Surgical Gastroentesrology, Surgical\n Oncology, Urology and Physiotherapy","2012-01-02"]
[null,289,"Prime Hospitals, Plot No. 4, Mytri Vihar,\nBehind Mytrivanam Buildings, Ameerpet,\nHyderabad.","2008-10-23","24151/LC.B/2008","Anaesthesiology, Cardiology, C.T.\n Surgery, E.N.T., Emergency Medicine,\n General Medicine, General Surgery,\n Nephrology, Neuro Surgery, OBG.,\n Orthopedics, Pediatrics, Pathology,\n Plastic Surgery, Pulmanology,\n Radiology, Surgical Gastro Enterology,\n Surgical Oncology,","2011-10-22","Prime Hospitals, Plot No. 4, Mytri Vihar,\nBehind Mytrivanam Buildings, Ameerpet,\nHyderabad.","2008-10-23","24151/LC.B/2008","Anaesthesiology, Cardiology, C.T.\n Surgery, E.N.T., Emergency Medicine,\n General Medicine, General Surgery,\n Nephrology, Neuro Surgery, OBG.,\n Orthopedics, Pediatrics, Pathology,\n Plastic Surgery, Pulmanology,\n Radiology, Surgical Gastro Enterology,\n Surgical Oncology,","2011-10-22"]
[null,290,"Prime Hospitals, Road. No. 1 K.P.H.B Colony\nKukatpally, Hyderabad.","2009-06-19","6784/LC-B/2009","Anesthesiology, Cardiology,\n C.T.Surgery, ENT, Emergency\n Medicine, Gesneral Medicine, General\n surgery, Nephrology, Neuro Surgery,\n OBG, Orthopaedics, Paediatrics,\n Pathology, Plastic Surgery,\n Pulmonology, Radiology, Oncology,\n Urology, Physiotherapy and Dialysis","2012-06-18","Prime Hospitals, Road. No. 1 K.P.H.B Colony\nKukatpally, Hyderabad.","2009-06-19","6784/LC-B/2009","Anesthesiology, Cardiology,\n C.T.Surgery, ENT, Emergency\n Medicine, Gesneral Medicine, General\n surgery, Nephrology, Neuro Surgery,\n OBG, Orthopaedics, Paediatrics,\n Pathology, Plastic Surgery,\n Pulmonology, Radiology, Oncology,\n Urology, Physiotherapy and Dialysis","2012-06-18"]
[null,291,"Princess Durru Shahvar Children's & General\nHospital, Purana Haveli, Hyderabad","2010-07-03","9087/LC-B/2010","General Medicine, General Susrgery,\n Emergency Medicine,\n Anaesthesiology, OBG, ENT,\n Paediatrics, Orthopaedics, Radiology,\n Plastic Surgery, Pathology and\n Physiothesrapy","2013-07-02","Princess Durru Shahvar Children's & General\nHospital, Purana Haveli, Hyderabad","2010-07-03","9087/LC-B/2010","General Medicine, General Susrgery,\n Emergency Medicine,\n Anaesthesiology, OBG, ENT,\n Paediatrics, Orthopaedics, Radiology,\n Plastic Surgery, Pathology and\n Physiothesrapy","2013-07-02"]
[null,292,"Prithvi Hospital, 1-7-696, Subedari,\nHanumakonda, Warangal.","3-Feb-2009","29683/LC.B/2008","Cardiology","2-Feb-2012","Prithvi Hospital, 1-7-696, Subedari,\nHanumakonda, Warangal.","3-Feb-2009","29683/LC.B/2008","Cardiology","2-Feb-2012"]
[null,293,"Purna Heart Institute Kovelamudivari Street,\nSuryaraopet,Vijayawada","27-Jul-2007","35267/LC-B/2006","Cardiac","26-Jul-2010","Purna Heart Institute Kovelamudivari Street,\nSuryaraopet,Vijayawada","27-Jul-2007","35267/LC-B/2006","Cardiac","26-Jul-2010"]
[null,294,"Pushpagiri Eye Institute ( A unit of Pushpagiri\nVitreo Ratia Institute), 241- Uma Plaza, 10-2-\n342, West Paredpally, Secunderabad.","2008-04-04","16162/LC,B/2007","Opthalomology","2011-04-03","Pushpagiri Eye Institute ( A unit of Pushpagiri\nVitreo Ratia Institute), 241- Uma Plaza, 10-2-\n342, West Paredpally, Secunderabad.","2008-04-04","16162/LC,B/2007","Opthalomology","2011-04-03"]
[null,295,"Queen's N.R.I. Hospital, Gurudwara Lane,\nSeethammadhara, Visakhapatnam.","2008-01-08","1804/LC.B/2006","General Medicine, General Surgery,\n O.B.G., Pediatrics, Orthopedics,\n Cardiology, Nephrology, Neurology,\n Gastro Enterology, Oncology, C.T.\n Surgery, Surgical Gastro Enterology,\n E.N.T., Plastic Surgeryand Physio\n Therapy","2011-01-07","Queen's N.R.I. Hospital, Gurudwara Lane,\nSeethammadhara, Visakhapatnam.","2008-01-08","1804/LC.B/2006","General Medicine, General Surgery,\n O.B.G., Pediatrics, Orthopedics,\n Cardiology, Nephrology, Neurology,\n Gastro Enterology, Oncology, C.T.\n Surgery, Surgical Gastro Enterology,\n E.N.T., Plastic Surgeryand Physio\n Therapy","2011-01-07"]
[null,296,"R.K. Super Speciality Dental Hospital, Andhra\nBank Complex, Kothapet Cross Roads,\nHyderabad","9-Jun-2006","807/LC.B/2006","Dental","8-Jun-2009","R.K. Super Speciality Dental Hospital, Andhra\nBank Complex, Kothapet Cross Roads,\nHyderabad","9-Jun-2006","807/LC.B/2006","Dental","8-Jun-2009"]
[null,297,"R.R. Hospitals, 40-304-10, Bhagya Nagar,\nKurnool.","2007-09-13","22791/LC.B/2006","General Medicine, General Surgery,\n OBG, Neurology, Neuro Surgery,\n Nephrology, Orthopedics, Pediatrics,\n Pediatric Surgery, Plastic Surgery,\n Urology, Gastro Enterology and E.N.T.","2010-09-12","R.R. Hospitals, 40-304-10, Bhagya Nagar,\nKurnool.","2007-09-13","22791/LC.B/2006","General Medicine, General Surgery,\n OBG, Neurology, Neuro Surgery,\n Nephrology, Orthopedics, Pediatrics,\n Pediatric Surgery, Plastic Surgery,\n Urology, Gastro Enterology and E.N.T.","2010-09-12"]
[null,298,"Radhakrishnan Hospitals, Netaji Compound,\nPrakashnagar, Raja Lane, Kurnool","2009-12-23","26332/LC-B/2009","OBG, General Surgery, Plastic Surgery\n and Orthopaedics and also\n Anaesthesiology, Cardiology, ENT,\n Emergency Medicine, General\n Medicine, Nephrology, Neuro Surgery,\n Paediatrics, Pathology, Pulmonology,\n Radiology, Surgical Gastroenterology,\n Urology and Surgical Oncology","2012-12-22","Radhakrishnan Hospitals, Netaji Compound,\nPrakashnagar, Raja Lane, Kurnool","2009-12-23","26332/LC-B/2009","OBG, General Surgery, Plastic Surgery\n and Orthopaedics and also\n Anaesthesiology, Cardiology, ENT,\n Emergency Medicine, General\n Medicine, Nephrology, Neuro Surgery,\n Paediatrics, Pathology, Pulmonology,\n Radiology, Surgical Gastroenterology,\n Urology and Surgical Oncology","2012-12-22"]
[null,299,"Raghavendra Hospital, Opp. Round Building\nE.C.I.L. Cross Roads, Hyderabad.","2009-02-03","29507/LC.B/2007","Genl. Medicine, Genl. Surgery,\n Anaesthesiology, Cardiology, OBG.,\n E.N.T., Pediatrics, Pathology,\n Orthopedics, Radiology and Physio\n Therapy.","2012-02-02","Raghavendra Hospital, Opp. Round Building\nE.C.I.L. Cross Roads, Hyderabad.","2009-02-03","29507/LC.B/2007","Genl. Medicine, Genl. Surgery,\n Anaesthesiology, Cardiology, OBG.,\n E.N.T., Pediatrics, Pathology,\n Orthopedics, Radiology and Physio\n Therapy.","2012-02-02"]
[null,300,"Rainbow Children Hospital, Plot No. C-17,\nVikrampuri Colony, Vikrampuri, Hyderabad","2009-09-22","20759/LC-B/2008","Paediatrics","21-Sept-2012","Rainbow Children Hospital, Plot No. C-17,\nVikrampuri Colony, Vikrampuri, Hyderabad","2009-09-22","20759/LC-B/2008","Paediatrics","21-Sept-2012"]
[null,301,"Rainbow Children's Hospital, 22, Road No.10,\nBanjara Hills, Hyderabad","2006-03-18","18539/LC-B/2005","Pediatrics","2012-03-17","Rainbow Children's Hospital, 22, Road No.10,\nBanjara Hills, Hyderabad","2006-03-18","18539/LC-B/2005","Pediatrics","2012-03-17"]
[null,302,"Raju Neuro & Multispeciality Hospital,and\nRaju Emergency Hospital, 76-4-7,\nGandhipuram-II, Rajahmundry","2005-12-05","7387/LC-B/2005","Multi"," 04-12-2011","Raju Neuro & Multispeciality Hospital,and\nRaju Emergency Hospital, 76-4-7,\nGandhipuram-II, Rajahmundry","2005-12-05","7387/LC-B/2005","Multi"," 04-12-2011"]
[null,303,"Rakesh Syper Speciality Dental Hospital, 16-2-\n835/11/2-A, APHB Main Road, Saidabad\nColony, Hyderabad","29-Jul-2010","12258/LC-B/2010","Dental","28-Jul-2013","Rakesh Syper Speciality Dental Hospital, 16-2-\n835/11/2-A, APHB Main Road, Saidabad\nColony, Hyderabad","29-Jul-2010","12258/LC-B/2010","Dental","28-Jul-2013"]
[null,304,"Ram Hospital, 57/A, Shapur Nagar, IDA\nJeedimetla, Hyderabad-500055","2006-03-18","18534/LC-B/2005","Anaesthesiology, General Medicine,\n General Surgery, Emergency Medicine,\n OBG, Paediatrics, Orthopaedics, ENT,\n Radiology, Cardiology, Neuro Surgery,\n Pathology, Plastic Surgery, Urology,\n Physiotherapy and Dialysis Unit","2012-03-17","Ram Hospital, 57/A, Shapur Nagar, IDA\nJeedimetla, Hyderabad-500055","2006-03-18","18534/LC-B/2005","Anaesthesiology, General Medicine,\n General Surgery, Emergency Medicine,\n OBG, Paediatrics, Orthopaedics, ENT,\n Radiology, Cardiology, Neuro Surgery,\n Pathology, Plastic Surgery, Urology,\n Physiotherapy and Dialysis Unit","2012-03-17"]
[null,305,"Rama Super Speciality Dental Hospital, Shop\nNo.14, Kamshetty Mall, Vishal Super Market\nComplex, T.V.Studio, Ramanthapur,\nHyderabad","2009-09-15","21998/LC-B/2009","Dental","2012-09-14","Rama Super Speciality Dental Hospital, Shop\nNo.14, Kamshetty Mall, Vishal Super Market\nComplex, T.V.Studio, Ramanthapur,\nHyderabad","2009-09-15","21998/LC-B/2009","Dental","2012-09-14"]
[null,306,"Ramya Hospitals, 9-11-130, Back Side of\nGandhi Statue, Gandhinagar, Kakinada","2010-08-07","8799/LC-B/2010","General Medicine, General Surgery,\n Anaesthesiology, ENT, OBG,\n Paediatrics, Pathology, Radiology and\n Surgical Oncology","2013-08-06","Ramya Hospitals, 9-11-130, Back Side of\nGandhi Statue, Gandhinagar, Kakinada","2010-08-07","8799/LC-B/2010","General Medicine, General Surgery,\n Anaesthesiology, ENT, OBG,\n Paediatrics, Pathology, Radiology and\n Surgical Oncology","2013-08-06"]
[null,307,"Ravi Dental Hospital & Implant Centre, Plot\nNo.C-31, Sharadha Theatre Lane,\nRukminipuri Colony, Hyderabad","23-Dec-2009","22986/LC-B/2009","Dental","22-Dec-2012","Ravi Dental Hospital & Implant Centre, Plot\nNo.C-31, Sharadha Theatre Lane,\nRukminipuri Colony, Hyderabad","23-Dec-2009","22986/LC-B/2009","Dental","22-Dec-2012"]
[null,308,"Ravi Institute of Child Health (RICH Hospitals)\n16-11/131, Kasturidevi Nagar, Pogathota,\nNellore","2006-07-22","7061/LC-B/2005","Paediatric","2012-07-21","Ravi Institute of Child Health (RICH Hospitals)\n16-11/131, Kasturidevi Nagar, Pogathota,\nNellore","2006-07-22","7061/LC-B/2005","Paediatric","2012-07-21"]
[null,309,"Ravichandra Super Speciality Dsental Clinic,\nVasavi Kanyakaparameshwari Temple\nComplex, Mahaboobabad, Warangal Dist.","2009-12-23","27879/LC-B/2009","Dental","2012-12-22","Ravichandra Super Speciality Dsental Clinic,\nVasavi Kanyakaparameshwari Temple\nComplex, Mahaboobabad, Warangal Dist.","2009-12-23","27879/LC-B/2009","Dental","2012-12-22"]
[null,310,"Remedy Heart Institute (A unit of Remedy\nHospital Ltd.), Opp. TTD, Himayatnagar,\nHyderabad The name of the\nhospital has been chanded to Hrushikeshya\nHospital (A unit of Remedy Hosptals) and\nshifted to: 2-6-71/a, Bharathnagar Colony,\nNear Masjid, Uppal, hyderabad","2006-05-06","19753/LC.B/2005","Anaesthesiology, Cardiology,\n C.T.Surgery, General Medicine,\n General Surgery, Nephrology, Neuro\n Surgery, OBG, Orthopaedics,\n Paediatrics, Plastic Surgery, Urology,\n Physiotherapy and Dialysis Unit","2012-05-05","Remedy Heart Institute (A unit of Remedy\nHospital Ltd.), Opp. TTD, Himayatnagar,\nHyderabad The name of the\nhospital has been chanded to Hrushikeshya\nHospital (A unit of Remedy Hosptals) and\nshifted to: 2-6-71/a, Bharathnagar Colony,\nNear Masjid, Uppal, hyderabad","2006-05-06","19753/LC.B/2005","Anaesthesiology, Cardiology,\n C.T.Surgery, General Medicine,\n General Surgery, Nephrology, Neuro\n Surgery, OBG, Orthopaedics,\n Paediatrics, Plastic Surgery, Urology,\n Physiotherapy and Dialysis Unit","2012-05-05"]
[null,311,"Remedy Hospitals, Ferozguda, Balanagar,\nHyderabad.","22-Jul-2006","25072/LC-B/2005","Multi","21-Jul-2009","Remedy Hospitals, Ferozguda, Balanagar,\nHyderabad.","22-Jul-2006","25072/LC-B/2005","Multi","21-Jul-2009"]
[null,312,"Remedy Hospitals, Road No.4, KPHB Colony,\nKukatpally, Hyderabad - 500 072","2006-06-09","20188/LC.B/2005","Cardiology, Orthopaedics, Neuro\n Surgery, Nephrology, Urology, General\n Surgery, OBG, Anaesthesiology, ENT,\n Plastic Surgery and Radiology","2012-06-08","Remedy Hospitals, Road No.4, KPHB Colony,\nKukatpally, Hyderabad - 500 072","2006-06-09","20188/LC.B/2005","Cardiology, Orthopaedics, Neuro\n Surgery, Nephrology, Urology, General\n Surgery, OBG, Anaesthesiology, ENT,\n Plastic Surgery and Radiology","2012-06-08"]
[null,313,"RENEE Hospital, Near Old Employement\nOffice, Karimnagar.","2008-04-23","1906/LC.B/2008","Genl. Medicine, Genl. Surgery, OBG.,\n Neuro Surgery, Anaesthesiology,\n E.N.T., and Physitherapy.","2011-04-22","RENEE Hospital, Near Old Employement\nOffice, Karimnagar.","2008-04-23","1906/LC.B/2008","Genl. Medicine, Genl. Surgery, OBG.,\n Neuro Surgery, Anaesthesiology,\n E.N.T., and Physitherapy.","2011-04-22"]
[null,314,"Rohini Medicare (Pvt.) Limited, Subedari,\nHanamkonda - 506 001, Warangal.","2006-02-23","20095/LC-B/2005","Anaesthesiology, Cardiology,\n Emergency Medicine, Genl. Medicine,\n General Surgery, Neuro Surgery,\n OBG., Orthopedics, Pediatrics,\n Pathology, Plastic Surgery,\n Pulmonology, Radiology and Urology","2012-02-22","Rohini Medicare (Pvt.) Limited, Subedari,\nHanamkonda - 506 001, Warangal.","2006-02-23","20095/LC-B/2005","Anaesthesiology, Cardiology,\n Emergency Medicine, Genl. Medicine,\n General Surgery, Neuro Surgery,\n OBG., Orthopedics, Pediatrics,\n Pathology, Plastic Surgery,\n Pulmonology, Radiology and Urology","2012-02-22"]
[null,315,"Rohit Text Tube Baby (IVF) Center, Wyra\nRoad, Khammam.","2009-03-20","27577/LC.B/2008","OBG., Genl. Surgery, Pediatrics and\n Anaesthesiology.","19-Mar-2012","Rohit Text Tube Baby (IVF) Center, Wyra\nRoad, Khammam.","2009-03-20","27577/LC.B/2008","OBG., Genl. Surgery, Pediatrics and\n Anaesthesiology.","19-Mar-2012"]
[null,316,"Royal Hospital, 20-23-4/A, Behind Nagadevi\nTheatre, Near Gokavaram Bus Stand,\nRajahmundry","2010-07-02","7221/LC-B/2010","General Medicine, General Surgery,\n Anaesthesiology, Emergency\n Medicine, OBG, Paediatrics, ENT,\n Neuro Surgery, Radiology, Plastic\n Surgery, Surgical Oncology, Surgical\n Gastroenterology, Urology and\n Physiotherapy","2013-07-01","Royal Hospital, 20-23-4/A, Behind Nagadevi\nTheatre, Near Gokavaram Bus Stand,\nRajahmundry","2010-07-02","7221/LC-B/2010","General Medicine, General Surgery,\n Anaesthesiology, Emergency\n Medicine, OBG, Paediatrics, ENT,\n Neuro Surgery, Radiology, Plastic\n Surgery, Surgical Oncology, Surgical\n Gastroenterology, Urology and\n Physiotherapy","2013-07-01"]
[null,317,"Royal Hospitals, 33-25-45, Kasturi Bai Pet,\nVijayawada","10-Aug-2007","6187/LC.B/2007","Orthopedics and Trauma Care","9-Aug-2010","Royal Hospitals, 33-25-45, Kasturi Bai Pet,\nVijayawada","10-Aug-2007","6187/LC.B/2007","Orthopedics and Trauma Care","9-Aug-2010"]
[null,318,"Rukku's save-in-smile Cosmetic and Dental\nspecilaity Hospital, Barkatpura, Hyderabad.","2005-11-16","18469/LC-B/2005","Dental","2011-11-15","Rukku's save-in-smile Cosmetic and Dental\nspecilaity Hospital, Barkatpura, Hyderabad.","2005-11-16","18469/LC-B/2005","Dental","2011-11-15"]
[null,319,"RUSSH Multi Super Speciality Hospital, D.No.\n10-14-576/6, Reddy & Reddy Colony, Opp.\nMunicipal Office, Tirupati, Chittoor Dist.","2010-07-02","45943/LC-B/2007","General Medicine, General Susrgery,\n Urology, OBG, Orthopaedics,\n Cardiology, Paediatrics, ENT and\n Plastic Surgery","2013-07-01","RUSSH Multi Super Speciality Hospital, D.No.\n10-14-576/6, Reddy & Reddy Colony, Opp.\nMunicipal Office, Tirupati, Chittoor Dist.","2010-07-02","45943/LC-B/2007","General Medicine, General Susrgery,\n Urology, OBG, Orthopaedics,\n Cardiology, Paediatrics, ENT and\n Plastic Surgery","2013-07-01"]
[null,320,"S.A.I. Hospitals, Aryapuram, Middle Street,\nOpp. Hotel Lalitha Mahal, Rajahmundry","2009-03-21","28215/LC.B/2008","Genl. Medicine, Genl. Surgery,\n Orthopedics, OBG., E.N.T., Neuro\n Surgery, Cardiology, Nephrology,\n Pediatrics, and Urology.","2012-03-20","S.A.I. Hospitals, Aryapuram, Middle Street,\nOpp. Hotel Lalitha Mahal, Rajahmundry","2009-03-21","28215/LC.B/2008","Genl. Medicine, Genl. Surgery,\n Orthopedics, OBG., E.N.T., Neuro\n Surgery, Cardiology, Nephrology,\n Pediatrics, and Urology.","2012-03-20"]
[null,321,"S.S. Dental Hospital, 17-1-23, Opp. K.G.H.\nClock Tower, Maharanipet, Visakhapatnam",{"$f":"I323","v":"2009-02-18"},{"$f":"J323","v":"39637/LC.B/2008"},{"$f":"K323","v":"Dental"},{"$f":"L323","v":"17-Feb-2012"},"S.S. Dental Hospital, 17-1-23, Opp. K.G.H.\nClock Tower, Maharanipet, Visakhapatnam","2009-02-18","39637/LC.B/2008","Dental","17-Feb-2012"]
[null,322,"S.V. Happy Smiles Multi SpecialtyDental\nHospital and Implant Center, 1 and 2 Ground\nFloor, B-5-5-181/2, Near Panama Godown,\nVanasthalipuram, Hyderabad","2009-02-18","42733/LC.B/2008","Dental","2012-02-17","S.V. Happy Smiles Multi SpecialtyDental\nHospital and Implant Center, 1 and 2 Ground\nFloor, B-5-5-181/2, Near Panama Godown,\nVanasthalipuram, Hyderabad","2009-02-18","42733/LC.B/2008","Dental","2012-02-17"]
[null,323,"S.V.Pooja Hospital, Plot No.33, Dharma\nReddy Colony, Phase II, Hydsernagar,\nKukatpally, Hyderabad","26-Mar-2010","3655/LC-B/2009","General Surgery","25-Mar-2013","S.V.Pooja Hospital, Plot No.33, Dharma\nReddy Colony, Phase II, Hydsernagar,\nKukatpally, Hyderabad","26-Mar-2010","3655/LC-B/2009","General Surgery","25-Mar-2013"]
[null,324,"Safe Emergency Hospital, 2-2-7, Usha Priya\nComplex, Bhanugudi, Kakinada, E.G.Dist.","2010-07-12","48012/LC-B/2009","General Medicine, General Surgery,\n Anaesthesiology, ENT, OBG, Surgical\n Gastroenterology, Paediatrics, Urology,\n Plastic Surgery, Cardiology,\n Pulmonology, Radiology, Neuro\n Surgery and Orthopaedics & Trauma\n Care","11-Jull-2013","Safe Emergency Hospital, 2-2-7, Usha Priya\nComplex, Bhanugudi, Kakinada, E.G.Dist.","2010-07-12","48012/LC-B/2009","General Medicine, General Surgery,\n Anaesthesiology, ENT, OBG, Surgical\n Gastroenterology, Paediatrics, Urology,\n Plastic Surgery, Cardiology,\n Pulmonology, Radiology, Neuro\n Surgery and Orthopaedics & Trauma\n Care","11-Jull-2013"]
[null,325,"Sagarlal Memorial Hospital & Matadin Goel\nResearch Centre, 1-5-551, Musheerabad,\nHyderabad","2009-08-29","28641/LC-B/2009","Anesthesiology, Gen. Med. Gen.\n Surgery,Cardiology, Orthopaedics,\n Radiology, Urology, OBG, Pediatrics,\n Nephrology, ENT, Pulmonology and\n Physiotherapy","2012-08-28","Sagarlal Memorial Hospital & Matadin Goel\nResearch Centre, 1-5-551, Musheerabad,\nHyderabad","2009-08-29","28641/LC-B/2009","Anesthesiology, Gen. Med. Gen.\n Surgery,Cardiology, Orthopaedics,\n Radiology, Urology, OBG, Pediatrics,\n Nephrology, ENT, Pulmonology and\n Physiotherapy","2012-08-28"]
[null,326,"Sai Bhavani Super Specialty Hospital, Main\nRoad, Shapur Nagar, Jeedimetla, Hyderabad.","2007-04-03","10452/LC-B/2006","Gen. Medicine, Gen. Surgery, ENT,\n OBG, Paediatrics, Cardiology,\n Cardiothorasic Surgery, Surgical\n Oncology, Nephrology,\n Gastroentrology, Anaesthesiology,\n Urology, Radiology, Neurology, Neuro\n Surgery, Orthopaedics, Pulmanology,\n Plastic Surgery.","2010-04-02","Sai Bhavani Super Specialty Hospital, Main\nRoad, Shapur Nagar, Jeedimetla, Hyderabad.","2007-04-03","10452/LC-B/2006","Gen. Medicine, Gen. Surgery, ENT,\n OBG, Paediatrics, Cardiology,\n Cardiothorasic Surgery, Surgical\n Oncology, Nephrology,\n Gastroentrology, Anaesthesiology,\n Urology, Radiology, Neurology, Neuro\n Surgery, Orthopaedics, Pulmanology,\n Plastic Surgery.","2010-04-02"]
[null,327,"Sai Care Hospital, Ambedkar Statue,\nHanumakonda, Warangal","2007-07-27","9098/LC-B/2007","Ansthesiology, ENT, Emergency\n Medicine, General Medicine,\n Nephrology, NeuroSurgery, OBG,\n Orthopedics, Pediatrcs, Pediatric\n Surgery, Plastic Surgery, Pulmanology,\n Urology & Phsiotheraphy","2010-07-26","Sai Care Hospital, Ambedkar Statue,\nHanumakonda, Warangal","2007-07-27","9098/LC-B/2007","Ansthesiology, ENT, Emergency\n Medicine, General Medicine,\n Nephrology, NeuroSurgery, OBG,\n Orthopedics, Pediatrcs, Pediatric\n Surgery, Plastic Surgery, Pulmanology,\n Urology & Phsiotheraphy","2010-07-26"]
[null,328,"Sai Krishna Super Speciality Neuro & Trauma\nHospital, Kachiguda, Hyderabad","2006-02-03","18496/LC-B/2006","Anaesthesiology, Cardiology, ENT,\n General Medicine, General Surgery,\n Nephrology, Neurosurgery,\n Orthopaedics and Pysiotherapy Unit","2012-02-02","Sai Krishna Super Speciality Neuro & Trauma\nHospital, Kachiguda, Hyderabad","2006-02-03","18496/LC-B/2006","Anaesthesiology, Cardiology, ENT,\n General Medicine, General Surgery,\n Nephrology, Neurosurgery,\n Orthopaedics and Pysiotherapy Unit","2012-02-02"]
[null,329,"Sai Ram Multi Speciality Hospital, 3-1-398,\nDr.B.R.Ambedkar Road, Beside TDP Office,\nKarimnagar","2010-05-25","1600/LC-B/2010","General Medicine, General Surgery,\n OBG, Paediatrics, Cardiology, Surgical\n Gastroenterology, Neuro Surgery,\n Plastic Surgery, Surgical Oncology,\n ENT and Pulmonology","2013-05-24","Sai Ram Multi Speciality Hospital, 3-1-398,\nDr.B.R.Ambedkar Road, Beside TDP Office,\nKarimnagar","2010-05-25","1600/LC-B/2010","General Medicine, General Surgery,\n OBG, Paediatrics, Cardiology, Surgical\n Gastroenterology, Neuro Surgery,\n Plastic Surgery, Surgical Oncology,\n ENT and Pulmonology","2013-05-24"]
[null,330,"Sai Srinivasa Speciality Pvt., Ltd.,\nNarayanaguda, Hyderabad","2009-11-10","14403/LC-B/2008","General Medicine, General Surgery,\n Anaesthesiology, Cardiology, ENT,\n Nephrology, Neuro Surgery, OBG,\n Orthopaedics, Paediatrics, Pathology,\n Plastic Surgery, Radiology, Surgical\n Gastroesnterology, Surgical Oncology,\n Pulmonology, Urology, Physiothesrapy\n and Dialysis","2012-11-09","Sai Srinivasa Speciality Pvt., Ltd.,\nNarayanaguda, Hyderabad","2009-11-10","14403/LC-B/2008","General Medicine, General Surgery,\n Anaesthesiology, Cardiology, ENT,\n Nephrology, Neuro Surgery, OBG,\n Orthopaedics, Paediatrics, Pathology,\n Plastic Surgery, Radiology, Surgical\n Gastroesnterology, Surgical Oncology,\n Pulmonology, Urology, Physiothesrapy\n and Dialysis","2012-11-09"]
[null,331,"Sai Vani Hospital, 1-2-365/36/6 & 7,\nRamakrsihna Math Road, Opp. Indira Park,\nDomalguda, Hyderabad","2006-03-18","18485/LC-B/2005","Anaesthesiology, Cardiology, ENT,\n Emergency Medicine, Nephrology,\n OBG, Orthopaedics, Paediatrics,\n Pathology, Plastic surgery,\n Pulmonology, Oncology, Urology,\n Physiotherapy, Dialysis, Neuro\n Surgery, General Medicine, General\n Surgery, Radiology and Surgical\n Gastroenterology","2012-03-17","Sai Vani Hospital, 1-2-365/36/6 & 7,\nRamakrsihna Math Road, Opp. Indira Park,\nDomalguda, Hyderabad","2006-03-18","18485/LC-B/2005","Anaesthesiology, Cardiology, ENT,\n Emergency Medicine, Nephrology,\n OBG, Orthopaedics, Paediatrics,\n Pathology, Plastic surgery,\n Pulmonology, Oncology, Urology,\n Physiotherapy, Dialysis, Neuro\n Surgery, General Medicine, General\n Surgery, Radiology and Surgical\n Gastroenterology","2012-03-17"]
[null,332,"Sai Venkata Sai (SVS) Medical College&\nHospital, Yenugonda, Mahabubnagar - 2","2007-04-03","14470/LC-B/2006","Anaesthesiology, Gen. Medicine, Gen.\n Surgery, ENT, OBG, Paediatrics,\n Orthopaedics, Pathology, Radiology,\n Physiotherapy","2010-04-02","Sai Venkata Sai (SVS) Medical College&\nHospital, Yenugonda, Mahabubnagar - 2","2007-04-03","14470/LC-B/2006","Anaesthesiology, Gen. Medicine, Gen.\n Surgery, ENT, OBG, Paediatrics,\n Orthopaedics, Pathology, Radiology,\n Physiotherapy","2010-04-02"]
[null,333,"Sai. Srinidhi Maternita Nursing Home, 11-3-\n1037/1, Opp. Abnus Function Hall, L.B. Nagar,\nWarangal.","7-Jul-2009","31169/LC-B/2009","OBG","6-Jul-2012","Sai. Srinidhi Maternita Nursing Home, 11-3-\n1037/1, Opp. Abnus Function Hall, L.B. Nagar,\nWarangal.","7-Jul-2009","31169/LC-B/2009","OBG","6-Jul-2012"]
[null,334,"Saiie Dental Speciality Hospital, 40-351,\nGandhi Nagar, Kurool","23-Dec-2009","26558/LC-B/2009","Dental","22-Dec-2012","Saiie Dental Speciality Hospital, 40-351,\nGandhi Nagar, Kurool","23-Dec-2009","26558/LC-B/2009","Dental","22-Dec-2012"]
[null,335,"Sanjana Palamoor Nursing Home, D.No. 8-6-\n257/7, Padmavathi Colony, Mahaboobnagar.","2006-11-10","1803/LC-B/2006","Anaesthesioogy, Cardiology, ENT,\n General Medicine, General Surgery,\n OBG, Orthopaedics, Paediatrics,\n Paediatrics, Platic Surgery, Urology\n and Surgical Gastroentesrology","2012-11-09","Sanjana Palamoor Nursing Home, D.No. 8-6-\n257/7, Padmavathi Colony, Mahaboobnagar.","2006-11-10","1803/LC-B/2006","Anaesthesioogy, Cardiology, ENT,\n General Medicine, General Surgery,\n OBG, Orthopaedics, Paediatrics,\n Paediatrics, Platic Surgery, Urology\n and Surgical Gastroentesrology","2012-11-09"]
[null,336,"Sanjeevanee Nursing Home, 3-3-163, Behind\nCivil Hospital, Karimnagar","26-May-2010","22987/LC-B/2009","General Surgery, OBG, Urology,\n Plastic Surgery, Surgical Oncology","25-May-2013","Sanjeevanee Nursing Home, 3-3-163, Behind\nCivil Hospital, Karimnagar","26-May-2010","22987/LC-B/2009","General Surgery, OBG, Urology,\n Plastic Surgery, Surgical Oncology","25-May-2013"]
[null,337,"Sanjivi Orthopedic and Physio Therapy\nCenter, Laxmipuram Main Road, Guntur","22-Jan-2008","16012/LC.B/2007","Orthopedic","21-Jan-2011","Sanjivi Orthopedic and Physio Therapy\nCenter, Laxmipuram Main Road, Guntur","22-Jan-2008","16012/LC.B/2007","Orthopedic","21-Jan-2011"]
[null,338,"Sankar Foundation Eye Hospital, D.No. 16-\n152, Srinivasa Nagar, Simhachalam Road,\nVisakhapatnam - 530027.","27-Jun-2006-","15508/LC-B/2005","Opthalomology","2012-06-26","Sankar Foundation Eye Hospital, D.No. 16-\n152, Srinivasa Nagar, Simhachalam Road,\nVisakhapatnam - 530027.","27-Jun-2006-","15508/LC-B/2005","Opthalomology","2012-06-26"]
[null,339,"Sankara Eye Hospital, Pedakakani,Guntur\nDist.","30-Sep-2009","2307/LC-B/2009","Ophthalmology","29-Sept-2012","Sankara Eye Hospital, Pedakakani,Guntur\nDist.","30-Sep-2009","2307/LC-B/2009","Ophthalmology","29-Sept-2012"]
[null,340,"Saradha Dental Hospital, 17-477, Sundaraiah\nStreet, Chittoor","9-Apr-2009","38845/LC.B/2008","Dental","8-Apr-2012","Saradha Dental Hospital, 17-477, Sundaraiah\nStreet, Chittoor","9-Apr-2009","38845/LC.B/2008","Dental","8-Apr-2012"]
[null,341,"Sarojini Hospital, Near Government Hospital,\nSawaran Street, Karimnagar","16-Apr-2010","22926/LC-B/2009","General Medicine, General Surgery,\n Orthopaedics, Paediatrics and\n Pathology","15-Apr-2013","Sarojini Hospital, Near Government Hospital,\nSawaran Street, Karimnagar","16-Apr-2010","22926/LC-B/2009","General Medicine, General Surgery,\n Orthopaedics, Paediatrics and\n Pathology","15-Apr-2013"]
[null,342,"Satya Hospital, Near Laxmi Talkies, JPN\nRaod, Warangal","21-Jun-2008","3579/LC.B/2008","Orthopedics","20-Jun-2011","Satya Hospital, Near Laxmi Talkies, JPN\nRaod, Warangal","21-Jun-2008","3579/LC.B/2008","Orthopedics","20-Jun-2011"]
[null,343,"Satya Kidney Centre, Street No.4,\nHimayathnagar, Hyderabad."," 25-Oct-2005","18434/LC-B/2005","Multi","2011-10-24","Satya Kidney Centre, Street No.4,\nHimayathnagar, Hyderabad."," 25-Oct-2005","18434/LC-B/2005","Multi","2011-10-24"]
[null,344,"Seha Hospital, Lakdikapool, Hyderabad.","2008-06-19","17333/LC.B/2008","Genl. Medicine, Genl. Surgery,\n Anaesthesiology, E.N.T., Emergency\n Medicine, OBG., Neuro Surgery,\n Pediatrics, Pathology, Plastic Surgery,\n Radiology, Orthopedics, Urology,\n Oncology, Physiotherapy and Dialysis.","2011-06-18","Seha Hospital, Lakdikapool, Hyderabad.","2008-06-19","17333/LC.B/2008","Genl. Medicine, Genl. Surgery,\n Anaesthesiology, E.N.T., Emergency\n Medicine, OBG., Neuro Surgery,\n Pediatrics, Pathology, Plastic Surgery,\n Radiology, Orthopedics, Urology,\n Oncology, Physiotherapy and Dialysis.","2011-06-18"]
[null,345,"Seven Hills Hospital, ( Seven Hills Healthcare\nPrivate Ltd.) Rockdale Layout,\nVisakhapatanam","2006-03-18","18540/LC-B/2005","Anaesthesiology, Cardiology,\n C.T.Surgery, ENT, Emergency\n Medicine, General Medicine, General\n Surgery, Orthopaedics, Nephrology,\n Neuro Surgery, OBG, Paediatrics,\n Pathology, Plastic Surgery,\n Pulmonology, Radiology, Surgical\n Gastroentesrology and Dialysis","2012-03-17","Seven Hills Hospital, ( Seven Hills Healthcare\nPrivate Ltd.) Rockdale Layout,\nVisakhapatanam","2006-03-18","18540/LC-B/2005","Anaesthesiology, Cardiology,\n C.T.Surgery, ENT, Emergency\n Medicine, General Medicine, General\n Surgery, Orthopaedics, Nephrology,\n Neuro Surgery, OBG, Paediatrics,\n Pathology, Plastic Surgery,\n Pulmonology, Radiology, Surgical\n Gastroentesrology and Dialysis","2012-03-17"]
[null,346,"Sharat Laser Eye Hospital, D.No. 3-1-119,\nKakatiya Colony, Alankar Circle,\nHanamkonda, Warangal Dist.","2006-07-22","1151/LC-B/2006","Opthalomology","2012-07-21","Sharat Laser Eye Hospital, D.No. 3-1-119,\nKakatiya Colony, Alankar Circle,\nHanamkonda, Warangal Dist.","2006-07-22","1151/LC-B/2006","Opthalomology","2012-07-21"]
[null,347,"Shashank Hospital, Doctors Street No.1, Opp.\nSheetal Scanning Centre, Khaleelwadi,\nNizamabad","2010-01-22","37885/LC-B/2008","General Medicine, General Surgery,\n OBG, Orthopaedics, Neuro Surgery,\n Urology, Paediatrics, ENT, Pathology\n and Urology","2013-01-21","Shashank Hospital, Doctors Street No.1, Opp.\nSheetal Scanning Centre, Khaleelwadi,\nNizamabad","2010-01-22","37885/LC-B/2008","General Medicine, General Surgery,\n OBG, Orthopaedics, Neuro Surgery,\n Urology, Paediatrics, ENT, Pathology\n and Urology","2013-01-21"]
[null,348,"Shiva Shree Super SpecialtyDental Care\nHospital, Padmavathi Complex, Khaleel Wadi,\nNizamabad.","2007-11-06","35982/LC.B/2006","Dental","5-Nov-2010","Shiva Shree Super SpecialtyDental Care\nHospital, Padmavathi Complex, Khaleel Wadi,\nNizamabad.","2007-11-06","35982/LC.B/2006","Dental","5-Nov-2010"]
[null,349,"Shravana Hospitals, 5-3-847, Mozamjahi\nMarket, Hyderabad","2006-07-22","19507/LC-B/2006","Anaesthesiology, Cardiology,\n C.T.Surgery, ENT, Emergency\n Medicine, General Medicine, General\n Surgery, Nephrology, Neuro Surgery,\n OBG, Orthopaedics, Paediatrics,\n Pathology, Plastic Surgery,\n Pulmonology, Radiology, Surgical\n Gastroentesrology, Urology and\n Physiotherapy","2012-07-21","Shravana Hospitals, 5-3-847, Mozamjahi\nMarket, Hyderabad","2006-07-22","19507/LC-B/2006","Anaesthesiology, Cardiology,\n C.T.Surgery, ENT, Emergency\n Medicine, General Medicine, General\n Surgery, Nephrology, Neuro Surgery,\n OBG, Orthopaedics, Paediatrics,\n Pathology, Plastic Surgery,\n Pulmonology, Radiology, Surgical\n Gastroentesrology, Urology and\n Physiotherapy","2012-07-21"]
[null,350,"Sibar Charitable Trust (Cancer Hospital),\nGovernorpet,Vijayawada","19-Jan-2006","18533/LC-B/2005","Cancer","18-Jan-2009","Sibar Charitable Trust (Cancer Hospital),\nGovernorpet,Vijayawada","19-Jan-2006","18533/LC-B/2005","Cancer","18-Jan-2009"]
[null,351,"Sibar Institute of Dental Sciences,\nTakkellapadu, Guntur","18-Feb-2009","13200/LC.B/2007","Dental","17-Feb-2012","Sibar Institute of Dental Sciences,\nTakkellapadu, Guntur","18-Feb-2009","13200/LC.B/2007","Dental","17-Feb-2012"]
[null,352,"Sigma Hospital, (A Unit of D.B.R Hospital Pvt.\nLtd.,35,S.D. Road, Secunderabad","2006-03-18","11066/LC-B/2005","General Medicine, General Surgery,\n Anaesthesiology, Cardiology,\n C.T.Surgery, Neuro Surgery,\n Nephrology, Plastic Surgery, ENT,\n OBG, Pulmonology, Orthopoaedics,\n Urology, and Surgical Oncology","2012-03-17","Sigma Hospital, (A Unit of D.B.R Hospital Pvt.\nLtd.,35,S.D. Road, Secunderabad","2006-03-18","11066/LC-B/2005","General Medicine, General Surgery,\n Anaesthesiology, Cardiology,\n C.T.Surgery, Neuro Surgery,\n Nephrology, Plastic Surgery, ENT,\n OBG, Pulmonology, Orthopoaedics,\n Urology, and Surgical Oncology","2012-03-17"]
[null,353,"Simhapuri Super Speciality Dental Hospital,\n16/201, Kasturidevi Nagar, Pogathota, Nellore","2-Jul-2010","46775/LC-B/2010","Dental","1-Jul-2013","Simhapuri Super Speciality Dental Hospital,\n16/201, Kasturidevi Nagar, Pogathota, Nellore","2-Jul-2010","46775/LC-B/2010","Dental","1-Jul-2013"]
[null,354,"Sindhu Multi Super Speciality Dental Hospital\n& Maxillo-Facial Trauma Care-Implant Centre,\nD.No. 18-399/3, Behind Satyanarayana\nSwamy Temple, Pargi Road, Shadnagar\nTown, Mahaboobnagar Dist.","2009-11-27","29364/LC-B/2009","Dental","2012-11-26","Sindhu Multi Super Speciality Dental Hospital\n& Maxillo-Facial Trauma Care-Implant Centre,\nD.No. 18-399/3, Behind Satyanarayana\nSwamy Temple, Pargi Road, Shadnagar\nTown, Mahaboobnagar Dist.","2009-11-27","29364/LC-B/2009","Dental","2012-11-26"]
[null,355,"Sindhura Hospital, New Bridge Road,\nSrikakulam","05-Jan-2010","39659/LC-B/2009","General Medicine, General Surgery,\n OBG, ENT, Paediatrics and\n Orthopaedics","04-Jan-2013","Sindhura Hospital, New Bridge Road,\nSrikakulam","05-Jan-2010","39659/LC-B/2009","General Medicine, General Surgery,\n OBG, ENT, Paediatrics and\n Orthopaedics","04-Jan-2013"]
[null,356,"Singari E.N.T. Hospital and Research Center\nPvt., Ltd., 29-9-54, Govindarajulu Naidu\nStreet, Suryaraopet, Vijayawada","16-Jan-2009","1511/LC.B/2007","E.N.T.","15-Jan-2012","Singari E.N.T. Hospital and Research Center\nPvt., Ltd., 29-9-54, Govindarajulu Naidu\nStreet, Suryaraopet, Vijayawada","16-Jan-2009","1511/LC.B/2007","E.N.T.","15-Jan-2012"]
[null,357,"Siri Multi Speciality Dental Hospital ( formerely\nSiri Dental Clinic, Narayanaguda, Hyd.) Opp.\nNew Bus Stand, Beside Sagar Medical Store,\nMallikarjunappa Complex, Sangareddy,\nMedak District)","2007-04-24","14474/LC-B/2006","Dental","2013-04-23","Siri Multi Speciality Dental Hospital ( formerely\nSiri Dental Clinic, Narayanaguda, Hyd.) Opp.\nNew Bus Stand, Beside Sagar Medical Store,\nMallikarjunappa Complex, Sangareddy,\nMedak District)","2007-04-24","14474/LC-B/2006","Dental","2013-04-23"]
[null,358,"Sivarama Hospitals, Opp. Rajarajeswari\nKalyanamandapam, Karimnagar.","2008-04-19","11564/LC.B/2006","Anaesthesiology, E.N.T., Emergency\n Medicine, Genl. Medicine, Cardiology,\n Neuro Surgery, OBG., Orthopedics,\n Pediatrics, Pulmanology, Plastic\n Surgery, urology, and Radiology.","2011-04-18","Sivarama Hospitals, Opp. Rajarajeswari\nKalyanamandapam, Karimnagar.","2008-04-19","11564/LC.B/2006","Anaesthesiology, E.N.T., Emergency\n Medicine, Genl. Medicine, Cardiology,\n Neuro Surgery, OBG., Orthopedics,\n Pediatrics, Pulmanology, Plastic\n Surgery, urology, and Radiology.","2011-04-18"]
[null,359,"SLMS Hospital Laproscopic & Research\nCentre, Plot No.21, Nagole 'X' Roads,\nHyderabad","12-Mar-2010","23882/LC-B/2009","Dental","11-Mar-2013","SLMS Hospital Laproscopic & Research\nCentre, Plot No.21, Nagole 'X' Roads,\nHyderabad","12-Mar-2010","23882/LC-B/2009","Dental","11-Mar-2013"]
[null,360,"Smile Care Dental Hospital, 11-9-7, Road\nNo. 1, SBI Colony, Nagole Road, Kothapet,\nHyderabad","30-Sep-2009","24748/LC-B/2009","Dental","29-Sept-2012","Smile Care Dental Hospital, 11-9-7, Road\nNo. 1, SBI Colony, Nagole Road, Kothapet,\nHyderabad","30-Sep-2009","24748/LC-B/2009","Dental","29-Sept-2012"]
[null,361,"Smile Care Super Speciality Dental Hospital,\nRCM Complex, Butchirajupalem, Near Andhra\nBank, NAD Kotha Road, Visakhapatnam","2009-11-27","20972/LC-B/2006","Dental","2012-11-26","Smile Care Super Speciality Dental Hospital,\nRCM Complex, Butchirajupalem, Near Andhra\nBank, NAD Kotha Road, Visakhapatnam","2009-11-27","20972/LC-B/2006","Dental","2012-11-26"]
[null,362,"Smile Crafters Dental Hospital, D.No. 10/432,\nDevi Nursing Home Road, Adimurthy Nagar,\nAnantapur","11-Jun-2010","4632/LC-B/2010","Dental","10-Jun-2013","Smile Crafters Dental Hospital, D.No. 10/432,\nDevi Nursing Home Road, Adimurthy Nagar,\nAnantapur","11-Jun-2010","4632/LC-B/2010","Dental","10-Jun-2013"]
[null,363,"Smile Dental Care, 2-1-50, Narayana Care\nComplex, Backside of Hotel Ishwarya Grand,\nKakinada","12-Mar-2010","39409/LC-B/2009","Dental","11-Mar-2013","Smile Dental Care, 2-1-50, Narayana Care\nComplex, Backside of Hotel Ishwarya Grand,\nKakinada","12-Mar-2010","39409/LC-B/2009","Dental","11-Mar-2013"]
[null,364,"Smile Super Speciality Dental Hospital,\nRamesh Reddy Nagar, Near RTC Bus Stand,\nNellore","29-Jul-2010","45411/LC-B/2009","Dental","28-Jul-2013","Smile Super Speciality Dental Hospital,\nRamesh Reddy Nagar, Near RTC Bus Stand,\nNellore","29-Jul-2010","45411/LC-B/2009","Dental","28-Jul-2013"]
[null,365,"Smile Super SpescialityDental Hospital, C-\nCamp Centre, Opp. TTD Kalyana Mandapam,\nKurnool","23-Dec-2009","23538/LC-B/2009","Dental","22-Dec-2012","Smile Super SpescialityDental Hospital, C-\nCamp Centre, Opp. TTD Kalyana Mandapam,\nKurnool","23-Dec-2009","23538/LC-B/2009","Dental","22-Dec-2012"]
[null,366,"Smiline Dental Hospital Pvt.Ltd., 8-3-\n952/10/2&2/1, Sri Nagar Colony Road,\nPunjagutta, Hyderabad","2006-03-18","7280/LC-B/2005","Dental","2012-03-17","Smiline Dental Hospital Pvt.Ltd., 8-3-\n952/10/2&2/1, Sri Nagar Colony Road,\nPunjagutta, Hyderabad","2006-03-18","7280/LC-B/2005","Dental","2012-03-17"]
[null,367,"Smt. Bhagwan Devi Hospital, 21-7-191, Mama\nJumla Pathak Charkaman, Hyderabad -\n500002.","2007-02-17","19498/LC-B/2006","Anesthesiology, Cardiology, ENT,\n General Medicine, General Surgery,\n Nephrology, Obst & Gynecology,\n Orthopedics, Pediatrics, Neuro\n Surgery, Plastic Surgery, Urology,\n Pulmonology, Physiotherapy Unit and\n Dialysis Unit","2010-02-16","Smt. Bhagwan Devi Hospital, 21-7-191, Mama\nJumla Pathak Charkaman, Hyderabad -\n500002.","2007-02-17","19498/LC-B/2006","Anesthesiology, Cardiology, ENT,\n General Medicine, General Surgery,\n Nephrology, Obst & Gynecology,\n Orthopedics, Pediatrics, Neuro\n Surgery, Plastic Surgery, Urology,\n Pulmonology, Physiotherapy Unit and\n Dialysis Unit","2010-02-16"]
[null,368,"Sneha Hospitals, 5-5-348, Sarojini Devi\nLayout, Old Maternity Ruia Road, Tirupathi.","15-Dec-2008","547/LC.B/2008","Urology","14-Dec-2011","Sneha Hospitals, 5-5-348, Sarojini Devi\nLayout, Old Maternity Ruia Road, Tirupathi.","15-Dec-2008","547/LC.B/2008","Urology","14-Dec-2011"]
[null,369,"Snehalatha Nursing Home, 13-3510, Khaja\nNagar, Opp. Ganga Gowri Cine Complex,\nAnanthapur.","2008-10-14","11239/LC.B/2008","Anaesthesiology, E.N.T., Emergency\n Medicine, General Surgery, OBG.,\n Orthopedics, Pediatrics, Pathology,\n and Urology.","2011-10-13","Snehalatha Nursing Home, 13-3510, Khaja\nNagar, Opp. Ganga Gowri Cine Complex,\nAnanthapur.","2008-10-14","11239/LC.B/2008","Anaesthesiology, E.N.T., Emergency\n Medicine, General Surgery, OBG.,\n Orthopedics, Pediatrics, Pathology,\n and Urology.","2011-10-13"]
[null,370,"Soumya Multi Speciality Hospital, Karkhana,\nSecunderabad","2006-03-25","24648/LC-B/2005","Surgical Oncology, and Obst. & Gynec."," 24-05-2012","Soumya Multi Speciality Hospital, Karkhana,\nSecunderabad","2006-03-25","24648/LC-B/2005","Surgical Oncology, and Obst. & Gynec."," 24-05-2012"]
[null,371,"Spandana Hospitals Heart and Multi\nSpecialities, 8-1-172 and 173, Wyra Road,\nKhammam.","2008-10-21","44175/LC.B/2007","Anaesthesiology, Cardiology,\n Emergency Medicine, Genl. Medicine,\n General Surgery, Neuro Surgery,\n OBG., Orthopedics, Pathology,\n Radiology, Urology, Pediatrics, and\n Gastro Enterology.","2011-10-20","Spandana Hospitals Heart and Multi\nSpecialities, 8-1-172 and 173, Wyra Road,\nKhammam.","2008-10-21","44175/LC.B/2007","Anaesthesiology, Cardiology,\n Emergency Medicine, Genl. Medicine,\n General Surgery, Neuro Surgery,\n OBG., Orthopedics, Pathology,\n Radiology, Urology, Pediatrics, and\n Gastro Enterology.","2011-10-20"]
[null,372,"Sreelatha Hospitals, 12-21-4, Aryapuram,\nRajahmundry, E.G.Dist.","2010-07-02","8071/LC-B/2010","General Medicine, General surgery,\n Cardiology, OBG, Orthopaedics, ENT,\n Ansaesthesiology, Radiology, Urology,\n Nephrology and Pulmonology","2013-07-01","Sreelatha Hospitals, 12-21-4, Aryapuram,\nRajahmundry, E.G.Dist.","2010-07-02","8071/LC-B/2010","General Medicine, General surgery,\n Cardiology, OBG, Orthopaedics, ENT,\n Ansaesthesiology, Radiology, Urology,\n Nephrology and Pulmonology","2013-07-01"]
[null,373,"Sreenivasa Dental Hospital, 15-441-B-14,\nNear Neelam Sanjeeva Reddy Statue,\nSreekantam Circle, R.F.Road, Anantapur","12-Mar-2010","43393/LC-B/2009","Dental","11-Mar-2013","Sreenivasa Dental Hospital, 15-441-B-14,\nNear Neelam Sanjeeva Reddy Statue,\nSreekantam Circle, R.F.Road, Anantapur","12-Mar-2010","43393/LC-B/2009","Dental","11-Mar-2013"]
[null,374,"Sri Ashwini Hospital, Gayatri Estates, Kurnool.","2007-11-06","25847/LC.B/2006","General Medicine, General Surgery,\n OBG., Pediatrics, Neurosurgery,\n Pulmanary Medicine, Urology and\n Orthopedics.","2010-11-05","Sri Ashwini Hospital, Gayatri Estates, Kurnool.","2007-11-06","25847/LC.B/2006","General Medicine, General Surgery,\n OBG., Pediatrics, Neurosurgery,\n Pulmanary Medicine, Urology and\n Orthopedics.","2010-11-05"]
[null,375,"Sri Bala Nursing Home, 12-2-24, Danturivari\nStreet, Kakinada, E.G.Dist.","23-Feb-2010","47305/LC-B/2009","ENT, Paediatrics and General Surgery","2013-02-23","Sri Bala Nursing Home, 12-2-24, Danturivari\nStreet, Kakinada, E.G.Dist.","23-Feb-2010","47305/LC-B/2009","ENT, Paediatrics and General Surgery","2013-02-23"]
[null,376,"Sri Devi Eye Hospital, 29-6-13A, Nakkal Road,\nSuryaraopet, Vijayawada.","2007-02-17","1796/LC-B/2006","Opthalomology","2013-02-16","Sri Devi Eye Hospital, 29-6-13A, Nakkal Road,\nSuryaraopet, Vijayawada.","2007-02-17","1796/LC-B/2006","Opthalomology","2013-02-16"]
[null,377,"Sri Durga Hospital and Brain Center, 15/266\nBrundavanam, Nellore","21-Oct-2008","24258/LC.B/2007","Genl. Medicine, Genl. Surgery, Neuro\n Surgery, OBG., and Orthopedics","20-Oct-2011","Sri Durga Hospital and Brain Center, 15/266\nBrundavanam, Nellore","21-Oct-2008","24258/LC.B/2007","Genl. Medicine, Genl. Surgery, Neuro\n Surgery, OBG., and Orthopedics","20-Oct-2011"]
[null,378,"Sri Krishna Multi Speciality Dental Hospital, 3-\n5-8, Govt. Girls Junior College Road,\nKarimnagar","30-Jul-2010","21029/LC-B/2010","Dental","29-Jul-2013","Sri Krishna Multi Speciality Dental Hospital, 3-\n5-8, Govt. Girls Junior College Road,\nKarimnagar","30-Jul-2010","21029/LC-B/2010","Dental","29-Jul-2013"]
[null,379,"Sri Krishna Sahithi Eye Hospital, D.No. 1/500,\nSmith Road, Near Z.P. Hospital, Opp. Y.S.\nGuest House, Kadapa","18-Feb-2009","46586/LC.B/2008","Ophthalmology","17-Feb-2012","Sri Krishna Sahithi Eye Hospital, D.No. 1/500,\nSmith Road, Near Z.P. Hospital, Opp. Y.S.\nGuest House, Kadapa","18-Feb-2009","46586/LC.B/2008","Ophthalmology","17-Feb-2012"]
[null,380,"Sri Laxmi Multi Speciality Dental Hospital 10-\n79, Beside RMO Office, Near Ambedkar\nStatue, Gajwel, Pragnapur, Medak Dist.","2010-03-26","33167/LC-B/2009","Dental","2013-03-25","Sri Laxmi Multi Speciality Dental Hospital 10-\n79, Beside RMO Office, Near Ambedkar\nStatue, Gajwel, Pragnapur, Medak Dist.","2010-03-26","33167/LC-B/2009","Dental","2013-03-25"]
[null,381,"Sri Laxmi Nursing Home, Jagitial, Karimnagar\nDist.","2009-05-02","18895/LC.B/2008","Genl. Surgery, Urology, ENT., Surgical\n Oncology, Plastic Surgery, OBG. And\n Orthopedics.","1-May-2012","Sri Laxmi Nursing Home, Jagitial, Karimnagar\nDist.","2009-05-02","18895/LC.B/2008","Genl. Surgery, Urology, ENT., Surgical\n Oncology, Plastic Surgery, OBG. And\n Orthopedics.","1-May-2012"]
[null,382,"Sri Laxmi Super Speciality Dental Hospital, 3-\n1-343, Beside Old Employemnt Office, Dr.\nAmbed Kar Road, Karimnagar.","30-May-2009","7014/LC.B/2009","Dental","29-May-2012","Sri Laxmi Super Speciality Dental Hospital, 3-\n1-343, Beside Old Employemnt Office, Dr.\nAmbed Kar Road, Karimnagar.","30-May-2009","7014/LC.B/2009","Dental","29-May-2012"]
[null,383,"Sri Maithri Hospital, Khaleelwadi, Nizamabad","3-Jan-2009","2845/LC.B/2007","Genl. Medicine, General Surgery,\n Orthopedics, ENT, Pediatrics and\n Neuro Surgery","2-Jan-2012","Sri Maithri Hospital, Khaleelwadi, Nizamabad","3-Jan-2009","2845/LC.B/2007","Genl. Medicine, General Surgery,\n Orthopedics, ENT, Pediatrics and\n Neuro Surgery","2-Jan-2012"]
[null,384,"Sri Murali Super Speciality Dental Hospital,\nOpp.Ganga Hotel, Srinivasa Centre, Nandyal,\nKurnool Dist.","16-Apr-2009","43213/LC-B/2009","Dental","","Sri Murali Super Speciality Dental Hospital,\nOpp.Ganga Hotel, Srinivasa Centre, Nandyal,\nKurnool Dist.","16-Apr-2009","43213/LC-B/2009","Dental",""]
[null,385,"Sri New Balaji Super Speciality Hospital,\n43/19, N.R.Pet, Kurnool",{"$f":"I387","v":"2009-11-27"},{"$f":"J387","v":"25370/LC-B/2009"},{"$f":"K387","v":"General Medicine, General Surgery,\n OBG, Orthopaedics, Neuro Surgery,\n Urology, Plastic Surgery, Pulmonology,\n ENT and Physiotherapy"},{"$f":"L387","v":"2012-11-26"},"Sri New Balaji Super Speciality Hospital,\n43/19, N.R.Pet, Kurnool","2009-11-27","25370/LC-B/2009","General Medicine, General Surgery,\n OBG, Orthopaedics, Neuro Surgery,\n Urology, Plastic Surgery, Pulmonology,\n ENT and Physiotherapy","2012-11-26"]
[null,386,"Sri Prasanna Kamakshi Super Speciality\nDental Clinic, 2-13-14, Kavali, Nellore\nDistrict","7-Aug-2010","17943/LC-B/2010","Dental","6-Aug-2013","Sri Prasanna Kamakshi Super Speciality\nDental Clinic, 2-13-14, Kavali, Nellore\nDistrict","7-Aug-2010","17943/LC-B/2010","Dental","6-Aug-2013"]
[null,387,"Sri Raksha Hospital, 11-5-79, NST Road,\nSanjeeva Reddy Bhavan Backside,\nKhammam","2010-05-26","8914/LC-B/2009","Anaesthesiology, General Medicine,\n General Surgery, Emergency Medicine,\n Cardiology, OBG, Paediatrics,\n Orthopaedics, Neuro Surgery,\n Pathology and Pulmonology","2013-05-25","Sri Raksha Hospital, 11-5-79, NST Road,\nSanjeeva Reddy Bhavan Backside,\nKhammam","2010-05-26","8914/LC-B/2009","Anaesthesiology, General Medicine,\n General Surgery, Emergency Medicine,\n Cardiology, OBG, Paediatrics,\n Orthopaedics, Neuro Surgery,\n Pathology and Pulmonology","2013-05-25"]
[null,388,"Sri Ram Kidney, Infertility and Laproscopic\nCenter, Balaji Nagar, Wyra Road, Khammam.","3-Jul-2008","47022/LC.B/2007","Urology and OBG.","2-Jul-2011","Sri Ram Kidney, Infertility and Laproscopic\nCenter, Balaji Nagar, Wyra Road, Khammam.","3-Jul-2008","47022/LC.B/2007","Urology and OBG.","2-Jul-2011"]
[null,389,"Sri Rama Dental Super Specialities, Opp.\nDanavaipet Park Main Gate, Rajahmundry,\nE.G. Dist.","29-Apr-2008","5033/LC.B/2008","Dental","28-Apr-2011","Sri Rama Dental Super Specialities, Opp.\nDanavaipet Park Main Gate, Rajahmundry,\nE.G. Dist.","29-Apr-2008","5033/LC.B/2008","Dental","28-Apr-2011"]
[null,390,"Sri Rama Devi Multi Specialty Hospital, T.S.\n82, Sairam Street, Tirupathi","6-Nov-2007","2439/LC.B/2007","General Medicine, Neuro Surgery and\n Orthopedics","5-Nov-2010","Sri Rama Devi Multi Specialty Hospital, T.S.\n82, Sairam Street, Tirupathi","6-Nov-2007","2439/LC.B/2007","General Medicine, Neuro Surgery and\n Orthopedics","5-Nov-2010"]
[null,391,"Sri Rama Multi Speciality Dental Hospital,\nGupta Complex, Beside Municipal Office,\nKamareddy, Nizambad District","19-Jun-2009","42253/LC-B/2009","Dental","18-Jun-2012","Sri Rama Multi Speciality Dental Hospital,\nGupta Complex, Beside Municipal Office,\nKamareddy, Nizambad District","19-Jun-2009","42253/LC-B/2009","Dental","18-Jun-2012"]
[null,392,"Sri Rama Multi Speciality Hospital\nJummikunta, Karimnagar District.","2009-06-19","2424/LC-B/2009","Anesthesiology, Gen. Med. Gen.\n Surgery, OBG, Orthopaedics, Urology,\n ENT, Pulmonology, Radiology,\n Pediatrics and Pathology","2012-06-18","Sri Rama Multi Speciality Hospital\nJummikunta, Karimnagar District.","2009-06-19","2424/LC-B/2009","Anesthesiology, Gen. Med. Gen.\n Surgery, OBG, Orthopaedics, Urology,\n ENT, Pulmonology, Radiology,\n Pediatrics and Pathology","2012-06-18"]
[null,393,"Sri Sai Apollo Super Speciality Dental\nHospital, 11-158, 159, 162, Subhash Road,\nNear Saptagiri Circle, Anantapur","3-Jul-2010","10660/LC-B/2010","Dental","2-Jul-2013","Sri Sai Apollo Super Speciality Dental\nHospital, 11-158, 159, 162, Subhash Road,\nNear Saptagiri Circle, Anantapur","3-Jul-2010","10660/LC-B/2010","Dental","2-Jul-2013"]
[null,394,"Sri Sai Dental Hospital & Implant Centre,\nJagitial, Karimnagar Dist.","7-Aug-2010","4911/LC-B/2010","Dental","6-Aug-2013","Sri Sai Dental Hospital & Implant Centre,\nJagitial, Karimnagar Dist.","7-Aug-2010","4911/LC-B/2010","Dental","6-Aug-2013"]
[null,395,"Sri Sai Hospitals, 5/2, Arundalpet, Guntur -\n522002","2007-02-17","3016/LC-B/2006","General Medicine, General Surgery,\n ENT,OBG, Neuro Surgery, Urology,\n Gastroentrology, Orthopaedics and\n Neurology","2010-02-16","Sri Sai Hospitals, 5/2, Arundalpet, Guntur -\n522002","2007-02-17","3016/LC-B/2006","General Medicine, General Surgery,\n ENT,OBG, Neuro Surgery, Urology,\n Gastroentrology, Orthopaedics and\n Neurology","2010-02-16"]
[null,396,"Sri Sai Kidney Center, (A Unit of Twin Cities\nKidney Center Pvt Ltd.), 7-1-59/4/8, Near Lal\nBunglow, Ameerpet, Hyderabad.","22-Jul-2006","14465/LC-B/2006","Kidney","21-Jul-2009","Sri Sai Kidney Center, (A Unit of Twin Cities\nKidney Center Pvt Ltd.), 7-1-59/4/8, Near Lal\nBunglow, Ameerpet, Hyderabad.","22-Jul-2006","14465/LC-B/2006","Kidney","21-Jul-2009"]
[null,397,"Sri Sai Neuro & Trauma Super Speciality\nHospital, South Bypass Road, Opp.Pragathi\nBhavan, Ongole, Prakasam Dist.","2009-09-30","Neuro Surgery,","Neruo Surgery, Orthopaedics, General\n Surgery, General Medicine, OBG,\nOrthopadics\n Plastic Surgery, Paediatrics and\n Surgical Gastroenterology","2012-09-29","Sri Sai Neuro & Trauma Super Speciality\nHospital, South Bypass Road, Opp.Pragathi\nBhavan, Ongole, Prakasam Dist.","2009-09-30","Neuro Surgery,","Neruo Surgery, Orthopaedics, General\n Surgery, General Medicine, OBG,\nOrthopadics\n Plastic Surgery, Paediatrics and\n Surgical Gastroenterology","2012-09-29"]
[null,398,"Sri Sai Nursing Home, 20-692-1, Co-operative\nColony, Beside Nehru Park, Kadapa","24-Apr-2010","37365/LC-B/2009","Ophthalmology","23-Apr-2013","Sri Sai Nursing Home, 20-692-1, Co-operative\nColony, Beside Nehru Park, Kadapa","24-Apr-2010","37365/LC-B/2009","Ophthalmology","23-Apr-2013"]
[null,399,"Sri Sai P.V.R. Hospitals, 8-10-139a, Railway\nStation Road, Behind Leela Mahal Theatre,\nVizianagaram","26-May-2010","1202/LC-B/2010","General Surgery, Orthopaedics, OBG\n and Paediatrics","25-May-2013","Sri Sai P.V.R. Hospitals, 8-10-139a, Railway\nStation Road, Behind Leela Mahal Theatre,\nVizianagaram","26-May-2010","1202/LC-B/2010","General Surgery, Orthopaedics, OBG\n and Paediatrics","25-May-2013"]
[null,400,"Sri Sai Praja Hospital Pvt.,Ltd., 1-9-228, Opp.\nCivil Hospital Main Gate, Metpally,\nKarimnagar Dist.","24-Apr-2010","36374/LC-B/2009","General Medicine, General Surgery,\n Orthopaedics, OBG and ENT","23-Apr-2013","Sri Sai Praja Hospital Pvt.,Ltd., 1-9-228, Opp.\nCivil Hospital Main Gate, Metpally,\nKarimnagar Dist.","24-Apr-2010","36374/LC-B/2009","General Medicine, General Surgery,\n Orthopaedics, OBG and ENT","23-Apr-2013"]
[null,401,"Sri Sai Super Speciality Hospital, Near RTC\nComplex, L.T.Road, Vizianagaram","22-Jan-2010","39369/LC-B/2008","General Surgery, OBG, ENT, Neuro\n Surgery, Orthopaedics, Urology and\n Plastic Surgery","21-Jan-2013","Sri Sai Super Speciality Hospital, Near RTC\nComplex, L.T.Road, Vizianagaram","22-Jan-2010","39369/LC-B/2008","General Surgery, OBG, ENT, Neuro\n Surgery, Orthopaedics, Urology and\n Plastic Surgery","21-Jan-2013"]
[null,402,"Sri Satya Sai Dental Hospital, 6/880, Near\nNamesthe Road, Shankarapuram, Kadapa","3-Jan-2009","2345/LC.B/2007","Dental","2-Jan-2012","Sri Satya Sai Dental Hospital, 6/880, Near\nNamesthe Road, Shankarapuram, Kadapa","3-Jan-2009","2345/LC.B/2007","Dental","2-Jan-2012"]
[null,403,"Sri Sharanya Nursing Home and Critical Care\nCenter, Hanumakonda, Warangal","21-Oct-2008","17005/LC.B/2008","Obstt. and Gynec.","20-Oct-2011","Sri Sharanya Nursing Home and Critical Care\nCenter, Hanumakonda, Warangal","21-Oct-2008","17005/LC.B/2008","Obstt. and Gynec.","20-Oct-2011"]
[null,404,"Sri Surya Dental Hospital, 14-37-4, Krishna\nNagar, Maharanipet, Visakhapatnam","6-Jan-2009","29564/LC.B.2008","Dental","5-Jan-2012","Sri Surya Dental Hospital, 14-37-4, Krishna\nNagar, Maharanipet, Visakhapatnam","6-Jan-2009","29564/LC.B.2008","Dental","5-Jan-2012"]
[null,405,"Sri Venkata Dental Hospital, Behind Civil\nHospital, Karimnagar.","21-Apr-2008","22883/LC.B/2006","Dental","20-Apr-2011","Sri Venkata Dental Hospital, Behind Civil\nHospital, Karimnagar.","21-Apr-2008","22883/LC.B/2006","Dental","20-Apr-2011"]
[null,406,"Sri Venkata Ramana Dental Hospital, Beside\nSBH, Ashoknagar, Gollapally Road, Jagitial,\nKarimnagar Dist.","27-Nov-2009","4860/LC-B/2009","Dental","26-Nov-2012","Sri Venkata Ramana Dental Hospital, Beside\nSBH, Ashoknagar, Gollapally Road, Jagitial,\nKarimnagar Dist.","27-Nov-2009","4860/LC-B/2009","Dental","26-Nov-2012"]
[null,407,"Sri Venkata Sai Medical College Hospital,\nYenugonda, Mahaboobnagar","13-May-2010","11241/LC-B/2008","Ophthalmology","12-May-2013","Sri Venkata Sai Medical College Hospital,\nYenugonda, Mahaboobnagar","13-May-2010","11241/LC-B/2008","Ophthalmology","12-May-2013"]
[null,408,"Sri Vijaya Durga Cardiac Centre 46-728-C,\nBudhawarpet, Kurnool","2006-06-09","1793/LC.B/2006","Cardiac Specilization"," 08-06-2012","Sri Vijaya Durga Cardiac Centre 46-728-C,\nBudhawarpet, Kurnool","2006-06-09","1793/LC.B/2006","Cardiac Specilization"," 08-06-2012"]
[null,409,"Sri Yamini Dental Clinic, Sundaraiah Bhavan\nRoad, Ongole, Prakasam District.","19-Jun-2009","10549/LC-B/2009","Dental","18-Jun-2012","Sri Yamini Dental Clinic, Sundaraiah Bhavan\nRoad, Ongole, Prakasam District.","19-Jun-2009","10549/LC-B/2009","Dental","18-Jun-2012"]
[null,410,"Sri. Kamakshi Sai Deantal Clinic, 6-2-93,Opp.\nBala Mandir, Old Maternity Hospital, Tirupathi.","7-Jul-2009","12633/LC-B/2009","Dental","6-Jul-2012","Sri. Kamakshi Sai Deantal Clinic, 6-2-93,Opp.\nBala Mandir, Old Maternity Hospital, Tirupathi.","7-Jul-2009","12633/LC-B/2009","Dental","6-Jul-2012"]
[null,411,"Sricare Dental Hospital, 10-14-545/B,\nV.V.Mahal, Tirupathi","11-Mar-2010","42815/LC-B/2009","Dental","10-Mar-2013","Sricare Dental Hospital, 10-14-545/B,\nV.V.Mahal, Tirupathi","11-Mar-2010","42815/LC-B/2009","Dental","10-Mar-2013"]
[null,412,"Sridhar Super Speciality Dental Hospital, Opp.\nGold Spot, Ameerpet, Hyderabad.","24-Sep-2006","16863/LC-B/2006","Dental","23-Sep-2009","Sridhar Super Speciality Dental Hospital, Opp.\nGold Spot, Ameerpet, Hyderabad.","24-Sep-2006","16863/LC-B/2006","Dental","23-Sep-2009"]
[null,413,"Srikiran Institution of Ophthalmology,\nPenumarthy Road, Near Atchampeta Institute,\nKakinada, E.G. District","24-Jul-2009","11530/LC-B/2009","Ophthalmology","23-Jul-2012","Srikiran Institution of Ophthalmology,\nPenumarthy Road, Near Atchampeta Institute,\nKakinada, E.G. District","24-Jul-2009","11530/LC-B/2009","Ophthalmology","23-Jul-2012"]
[null,414,"Srilatha Modern Eye Hospital, 2-63/1, Officer's\nLane, Opp. Municipal Office, Chittoor.","23-Apr-2008","16990/LC.B/2007","Ophthalmology","21-May-2011","Srilatha Modern Eye Hospital, 2-63/1, Officer's\nLane, Opp. Municipal Office, Chittoor.","23-Apr-2008","16990/LC.B/2007","Ophthalmology","21-May-2011"]
[null,415,"Srinidhi Multi Speciality Dental Hospital 23-11-\n48, Sivaji Café Centre, Satyanarayanapuram,\nVijayawada","25-Mar-2010","36075/LC-B/2009","Dental","2013-03-24","Srinidhi Multi Speciality Dental Hospital 23-11-\n48, Sivaji Café Centre, Satyanarayanapuram,\nVijayawada","25-Mar-2010","36075/LC-B/2009","Dental","2013-03-24"]
[null,416,"Srinivasa Hospitals, D.No. 20-7-55,\nSundaraiah Bhavan Road, Beside RTC Depot,\nKurnool Road, Ongole, Prakasam Dist.","2010-07-30","5815/LC-B/2010","General Medicine, General Surgery,\n Anaesthesiology, OBG, Orthopaedics\n and Surgical Gastroenterology","2013-07-29","Srinivasa Hospitals, D.No. 20-7-55,\nSundaraiah Bhavan Road, Beside RTC Depot,\nKurnool Road, Ongole, Prakasam Dist.","2010-07-30","5815/LC-B/2010","General Medicine, General Surgery,\n Anaesthesiology, OBG, Orthopaedics\n and Surgical Gastroenterology","2013-07-29"]
[null,417,"Srinivasa Padmavathi Medicare Pvt. Ltd.,\nOpp. Thousand Pillars Temple, Hanamkonda,\nWarangal","2008-04-29","30416/LC-B/2007","General Medicine, General Surgery,\n Urology, OBG,Orthopaedics,\n Paediatrics and Anaesthesiology","28-Apr-2011","Srinivasa Padmavathi Medicare Pvt. Ltd.,\nOpp. Thousand Pillars Temple, Hanamkonda,\nWarangal","2008-04-29","30416/LC-B/2007","General Medicine, General Surgery,\n Urology, OBG,Orthopaedics,\n Paediatrics and Anaesthesiology","28-Apr-2011"]
[null,418,"Srujan Ortho and Accident Care Hospital,\nBalaji Nagar, Khammam.","6-Nov-2007","8265/LC.B/2007","Orthopedics","5-Nov-2010","Srujan Ortho and Accident Care Hospital,\nBalaji Nagar, Khammam.","6-Nov-2007","8265/LC.B/2007","Orthopedics","5-Nov-2010"]
[null,419,"St. Ann's Hospital, Fathimanagar, Kazipet,\nWarangal","9-Jun-2006","17514/LC.B/2005","Multi","8-Jun-2009","St. Ann's Hospital, Fathimanagar, Kazipet,\nWarangal","9-Jun-2006","17514/LC.B/2005","Multi","8-Jun-2009"]
[null,420,"St. Joseph's General Hospital, Opp. A.C.\nCollege, Main Road, Guntur.","2008-10-23","9879/LC.B/2006","Genl. Medicine, Genl. Surgery, OBG.,\n Pediatrics, Anaesthesiology, E.N.T.,\n Plastic Surgery, Cardiology, Neuro\n Surgery, Psychiatry, and Orthopedics.","2011-10-22","St. Joseph's General Hospital, Opp. A.C.\nCollege, Main Road, Guntur.","2008-10-23","9879/LC.B/2006","Genl. Medicine, Genl. Surgery, OBG.,\n Pediatrics, Anaesthesiology, E.N.T.,\n Plastic Surgery, Cardiology, Neuro\n Surgery, Psychiatry, and Orthopedics.","2011-10-22"]
[null,421,"Star Hospitals, Road No. 10, Banjara Hills,\nHyderabad.","2008-10-06","21374/LC.B/2008","C.T. Surgery, Cardiology,\n Anaesthesiology, Neuro Surgery,\n Radiology, Emergency Medicine,\n General Medicine, Pathology and\n Physio Therapy.","2011-10-05","Star Hospitals, Road No. 10, Banjara Hills,\nHyderabad.","2008-10-06","21374/LC.B/2008","C.T. Surgery, Cardiology,\n Anaesthesiology, Neuro Surgery,\n Radiology, Emergency Medicine,\n General Medicine, Pathology and\n Physio Therapy.","2011-10-05"]
[null,422,"Subham Prema Hospital, Rama Talkies\nJunction, Visakhapatanm.","2009-04-20","21432/LC.B/2005","Anaesthesiology, Cardiology, C.T.\n Surgery, ENT., Emergency Medicine,\n Genl. Medicine, Neuro Surgery,\n Neuclear Medicine, OBG.,\n Orthopedics, Pediatrics, Pathology,\n Plastic Surgery, Pulmanology,\n Radiology, Surgical Gastro Enterology,\n Surgical Oncology, Urology","2012-04-19","Subham Prema Hospital, Rama Talkies\nJunction, Visakhapatanm.","2009-04-20","21432/LC.B/2005","Anaesthesiology, Cardiology, C.T.\n Surgery, ENT., Emergency Medicine,\n Genl. Medicine, Neuro Surgery,\n Neuclear Medicine, OBG.,\n Orthopedics, Pediatrics, Pathology,\n Plastic Surgery, Pulmanology,\n Radiology, Surgical Gastro Enterology,\n Surgical Oncology, Urology","2012-04-19"]
[null,423,"Subhash Super Speciality Dental Hospital,\nBeside Navabharat Theatre, Guntur Road,\nOngole, Prakasam Dist.","2010-06-11","40974/LC-B/2009","Dental","10-Jun-2013","Subhash Super Speciality Dental Hospital,\nBeside Navabharat Theatre, Guntur Road,\nOngole, Prakasam Dist.","2010-06-11","40974/LC-B/2009","Dental","10-Jun-2013"]
[null,424,"Sudarsini Eye Hospital, Kothapet, Main Raod,\nGuntur.","23-Oct-2008","1897/LC.B/2008","Ophthalmology","22-Oct-2011","Sudarsini Eye Hospital, Kothapet, Main Raod,\nGuntur.","23-Oct-2008","1897/LC.B/2008","Ophthalmology","22-Oct-2011"]
[null,425,"Sudha Hospital, 21-1-4, Opp. Co-operative\nStores, Tanuku, W.G.Dist.","2010-03-12","34327/LC-B/2009","Anaesthesiology, General Medicine,\n General Surgery, Cardiology,\n Orthopaedics & Trauma Care, ENT,\n OBG, Surgical Gastroentesrology,\n Paediatrics, Urology and Plastic\n Surgery","2013-03-11","Sudha Hospital, 21-1-4, Opp. Co-operative\nStores, Tanuku, W.G.Dist.","2010-03-12","34327/LC-B/2009","Anaesthesiology, General Medicine,\n General Surgery, Cardiology,\n Orthopaedics & Trauma Care, ENT,\n OBG, Surgical Gastroentesrology,\n Paediatrics, Urology and Plastic\n Surgery","2013-03-11"]
[null,426,"Sudha Urology and AndrologyHospital, 10-5-\n8, Nageswara Rao Street, Ramanaraopet, 2nd\nJunction, Kakinada","08-Dec-2009","27158/LC-B/2009","Urology","07-Dec-2012","Sudha Urology and AndrologyHospital, 10-5-\n8, Nageswara Rao Street, Ramanaraopet, 2nd\nJunction, Kakinada","08-Dec-2009","27158/LC-B/2009","Urology","07-Dec-2012"]
[null,427,"Suhas Multi Speciality Dental Hospital,\n142&143, 1st floor, Navketen Complex, Opp.\nCloct Tower, S.D. Road, Secunderabad.","2009-07-07","36792/LC-B/2008","Dental","2012-07-06","Suhas Multi Speciality Dental Hospital,\n142&143, 1st floor, Navketen Complex, Opp.\nCloct Tower, S.D. Road, Secunderabad.","2009-07-07","36792/LC-B/2008","Dental","2012-07-06"]
[null,428,"Sunshine Hospitals, 1-7-201 to 205,\nPrenderghast Road, Secunderabad","2010-02-03","38259/LC-B/2009","Cardiology, C.T.Surgery, Emergency\n Medicine, General Medicine, General\n Surgery, OBG, Orthopaedics, Neuro\n Surgery, Paediatrics, Plastic Surgery,\n Pulmonology, Radiology, Surgical\n Oncology and Surgical\n Gastroentesrology","2013-02-02","Sunshine Hospitals, 1-7-201 to 205,\nPrenderghast Road, Secunderabad","2010-02-03","38259/LC-B/2009","Cardiology, C.T.Surgery, Emergency\n Medicine, General Medicine, General\n Surgery, OBG, Orthopaedics, Neuro\n Surgery, Paediatrics, Plastic Surgery,\n Pulmonology, Radiology, Surgical\n Oncology and Surgical\n Gastroentesrology","2013-02-02"]
[null,429,"Surya Global Hospital, Nageswara Rao Street,\nRamaraopet, Kakinada, East Godavary Dist.","2010-06-11","36567/LC-B/2008","General Medicine, General Surgery,\n Surgical Oncology, OBG, Paediatrics,\n ENT, Orthopaedics, Anaesthesiology,\n Neuro Surgery, Radiology and Plastic\n Surgery","2013-06-10","Surya Global Hospital, Nageswara Rao Street,\nRamaraopet, Kakinada, East Godavary Dist.","2010-06-11","36567/LC-B/2008","General Medicine, General Surgery,\n Surgical Oncology, OBG, Paediatrics,\n ENT, Orthopaedics, Anaesthesiology,\n Neuro Surgery, Radiology and Plastic\n Surgery","2013-06-10"]
[null,430,"Surya Nursing Home, Opp. Mission Hospital,\nKarimnagar.","2008-07-03","3558/LC.B/2008","Genl. Medicine, Genl. Surgery, OBG.,\n Orthopedics, Anesthesiology, Neuro\n Surgery, Plastic Surgery, Surgical\n Oncology, Pediatrics and Urology.","2011-07-02","Surya Nursing Home, Opp. Mission Hospital,\nKarimnagar.","2008-07-03","3558/LC.B/2008","Genl. Medicine, Genl. Surgery, OBG.,\n Orthopedics, Anesthesiology, Neuro\n Surgery, Plastic Surgery, Surgical\n Oncology, Pediatrics and Urology.","2011-07-02"]
[null,431,"Surya Sree Hospitals Pvt. Ltd., 15-14-9/1,\nKrishna Nagar, Maharanipeta, Visakhapatnam","2007-11-15","12787/LC.B/2007","General Medicine, General Surgery,\n Neurology, Neuro Surgery,\n Orthopedics, E.N.T., Nephrology,\n Urology, Gastro Enterology, OBG., and\n Anaesthesiology","2010-11-14","Surya Sree Hospitals Pvt. Ltd., 15-14-9/1,\nKrishna Nagar, Maharanipeta, Visakhapatnam","2007-11-15","12787/LC.B/2007","General Medicine, General Surgery,\n Neurology, Neuro Surgery,\n Orthopedics, E.N.T., Nephrology,\n Urology, Gastro Enterology, OBG., and\n Anaesthesiology","2010-11-14"]
[null,432,"Susheela Hospitals, 8-3-667/1, Engineers\nColony, Yousufguda Road, Near K.K. Towers,\nHyderabad","2008-10-06","23538/LC.B/2008","Anaesthesiology, Pathology,\n Radiology, Orthopedics, General\n Medicine, OBG., Pediatrics, Urology,\n Pulmanology, E.N.T., Neuro Surgery,\n Plasic Surgery, Cardiology, Nephrology\n and Physio Therapy.","2011-10-05","Susheela Hospitals, 8-3-667/1, Engineers\nColony, Yousufguda Road, Near K.K. Towers,\nHyderabad","2008-10-06","23538/LC.B/2008","Anaesthesiology, Pathology,\n Radiology, Orthopedics, General\n Medicine, OBG., Pediatrics, Urology,\n Pulmanology, E.N.T., Neuro Surgery,\n Plasic Surgery, Cardiology, Nephrology\n and Physio Therapy.","2011-10-05"]
[null,433,"Susheela Netralaya, Budhvarpet, Kurnool","22-May-2008","37122/LC.B/2006","Ophthalmology","21-May-2011","Susheela Netralaya, Budhvarpet, Kurnool","22-May-2008","37122/LC.B/2006","Ophthalmology","21-May-2011"]
[null,434,"Susrutha Peoples, Hospital, 1-4-80 C, New\nTown, Opp. S.B.H. Bank, Mahaboobnagar.","2009-07-07","43604/LC-B/2008","Anesthesiology, Gen. Med. Gen.\n Surgery, ENT, OBG, Orthopaedics,\n Paediatrics, Pathology, Plastic\n Surgery, Radiology, Urology and\n gastroenterology","2012-07-06","Susrutha Peoples, Hospital, 1-4-80 C, New\nTown, Opp. S.B.H. Bank, Mahaboobnagar.","2009-07-07","43604/LC-B/2008","Anesthesiology, Gen. Med. Gen.\n Surgery, ENT, OBG, Orthopaedics,\n Paediatrics, Pathology, Plastic\n Surgery, Radiology, Urology and\n gastroenterology","2012-07-06"]
[null,435,"SVR Neuro Hospital, 40-1/1-14, ABC,\nLabbipet, Vijayawada","2006-04-06","26357/LC-B/2005","General Medicine, General Surgery,\n Anaesthesiology, Neuro Surgery, OBG,\n Emergency Medicine, Orthopaedics &\n Traumatology","2012-04-05","SVR Neuro Hospital, 40-1/1-14, ABC,\nLabbipet, Vijayawada","2006-04-06","26357/LC-B/2005","General Medicine, General Surgery,\n Anaesthesiology, Neuro Surgery, OBG,\n Emergency Medicine, Orthopaedics &\n Traumatology","2012-04-05"]
[null,436,"SVS Dental Hospital, 7-2-571/6, Opp. Bata,\nR.P. Road, Seceunderabad.","2006-01-19","22124/LC-B/2005","Dental","2012-01-18","SVS Dental Hospital, 7-2-571/6, Opp. Bata,\nR.P. Road, Seceunderabad.","2006-01-19","22124/LC-B/2005","Dental","2012-01-18"]
[null,437,"Swamy Super SpecialtyNetralayam, Naldyal,\nKurnool.","3-Feb-2009","2832/LC.B.2008","Ophthalmology","2-Feb-2012","Swamy Super SpecialtyNetralayam, Naldyal,\nKurnool.","3-Feb-2009","2832/LC.B.2008","Ophthalmology","2-Feb-2012"]
[null,438,"Swaroop Eye Hospital and Laser Center,\n3/1176, T.B. Road, Proddutur, Kadapa","15-Sep-2008","27746/LC.B/2007","Ophthalmolgoy","14-Sep-2011","Swaroop Eye Hospital and Laser Center,\n3/1176, T.B. Road, Proddutur, Kadapa","15-Sep-2008","27746/LC.B/2007","Ophthalmolgoy","14-Sep-2011"]
[null,439,"Swarooparani Nursing Home, 23B-5/90,\nRamachandraraopest, Eluru, W.G.Dist.","2010-03-12","33028/LC-B/2009","Anaesthesiology, General Medicine,\n General Surgery, Orthopaedics &\n Trauma Care, ENT, OBG, Surgical\n Gastroentesrology, Paediatrics,\n Urology and Plastic Surgery","2013-03-11","Swarooparani Nursing Home, 23B-5/90,\nRamachandraraopest, Eluru, W.G.Dist.","2010-03-12","33028/LC-B/2009","Anaesthesiology, General Medicine,\n General Surgery, Orthopaedics &\n Trauma Care, ENT, OBG, Surgical\n Gastroentesrology, Paediatrics,\n Urology and Plastic Surgery","2013-03-11"]
[null,440,"Swatantra Hospitals (Multi Specialities) Pvt.\nLtd. Near Kambala Park, Rajahmundry","6-May-2006","20747/LC.B/2005","Multi","5-May-2009","Swatantra Hospitals (Multi Specialities) Pvt.\nLtd. Near Kambala Park, Rajahmundry","6-May-2006","20747/LC.B/2005","Multi","5-May-2009"]
[null,441,"Syamala Hospital, 11-5-15/1, Opp. Zilla\nParishad, Wyra Road, Khammam.","15-Sep-2008","19854/LC.B/2008","Genl. Surgery, and O.B.G.","14-Sep-2011","Syamala Hospital, 11-5-15/1, Opp. Zilla\nParishad, Wyra Road, Khammam.","15-Sep-2008","19854/LC.B/2008","Genl. Surgery, and O.B.G.","14-Sep-2011"]
[null,442,"T.J.R.Dental Hospital, H.No. 1-4-57/6/A,\nRajendra Nagar, Mahaboobnagar","11-Jun-2010","14892/LC-B/2010","Dental","10-Jun-2013","T.J.R.Dental Hospital, H.No. 1-4-57/6/A,\nRajendra Nagar, Mahaboobnagar","11-Jun-2010","14892/LC-B/2010","Dental","10-Jun-2013"]
[null,443,"The A.J. Multi Specialty Dental Hospital, Shop\nNo.2&3, Gayathri Enclave, Gayathri Estate\nMain Road, Kurnool","30-May-2009","7179/LC.B/2009","Dental","29-May-2012","The A.J. Multi Specialty Dental Hospital, Shop\nNo.2&3, Gayathri Enclave, Gayathri Estate\nMain Road, Kurnool","30-May-2009","7179/LC.B/2009","Dental","29-May-2012"]
[null,444,"The Smile Super Speciality Dental Clinic,\nVisakha Medical Centre Building, 1st Floor,\nSLN Towers, Collectorate Junction,\nMaharanipeta, Visakhapatnam","27-N0v-2009","21401/LC-B/2009","Dental","26-N0v-2012","The Smile Super Speciality Dental Clinic,\nVisakha Medical Centre Building, 1st Floor,\nSLN Towers, Collectorate Junction,\nMaharanipeta, Visakhapatnam","27-N0v-2009","21401/LC-B/2009","Dental","26-N0v-2012"]
[null,445,"Times Hospital, 6-2-413/B, Road No. 4,\nBanjara Hills, Hyderabad","23-Dec-2009","35967/LC-B/2008","General Medicine, General Surgery,\n OBG and Urology","22-Dec-2012","Times Hospital, 6-2-413/B, Road No. 4,\nBanjara Hills, Hyderabad","23-Dec-2009","35967/LC-B/2008","General Medicine, General Surgery,\n OBG and Urology","22-Dec-2012"]
[null,446,"Tirumala Nursing Home, Near R.T.C.\nComplex, Vizianagaram.","2008-04-18","7371/LC.B/2007","Cardiology, C.T. Surgery Laproscopic\n Surgery, Anaesthesiology,OBG,Genl.\nMedicine,Pulmanology,RadiologyPathology, Genl. Surgery,Gastroenterology, Orthopedics,Urology, Nephrology, NeuroMedicine,Neuro Surgery and Oncology.","2011-04-17","Tirumala Nursing Home, Near R.T.C.\nComplex, Vizianagaram.","2008-04-18","7371/LC.B/2007","Cardiology, C.T. Surgery Laproscopic\n Surgery, Anaesthesiology,OBG,Genl.\nMedicine,Pulmanology,RadiologyPathology, Genl. Surgery,Gastroenterology, Orthopedics,Urology, Nephrology, NeuroMedicine,Neuro Surgery and Oncology.","2011-04-17"]
[null,447,"Trident Multi Specialty Dental Hospital,\n16/569, Gandhi Nagar, Pogathota, Nellore","21-Oct-2008","14147/LC.B/2008","Dental","20-Oct-2011","Trident Multi Specialty Dental Hospital,\n16/569, Gandhi Nagar, Pogathota, Nellore","21-Oct-2008","14147/LC.B/2008","Dental","20-Oct-2011"]
[null,448,"Triveni Super Speciality Dental Hl. & Implant\nCentre, 2-16-1, Venkat Nagar , Kakinada,\nE.G.Dist.","30-Sep-2009","24088/LC-B/2009","Dental","29-Sept-2012","Triveni Super Speciality Dental Hl. & Implant\nCentre, 2-16-1, Venkat Nagar , Kakinada,\nE.G.Dist.","30-Sep-2009","24088/LC-B/2009","Dental","29-Sept-2012"]
[null,449,"Trust Hospitals, Gunttikonda Gopal Rao\nStreet, Kalanagar, Near Benz circle,\nVijayawada.",{"$f":"I451","v":"21-Oct-2008"},{"$f":"J451","v":"33417/LC.B/2006"},{"$f":"K451","v":"Orthopedics"},{"$f":"L451","v":"20-Oct-2011"},"Trust Hospitals, Gunttikonda Gopal Rao\nStreet, Kalanagar, Near Benz circle,\nVijayawada.","21-Oct-2008","33417/LC.B/2006","Orthopedics","20-Oct-2011"]
[null,450,"Udai Clinic Orthopedic Center, Chappal Road,\nHyderabad.","10-Aug-2007","2873/LC.B/2007","Orhopedics","9-Aug-2010","Udai Clinic Orthopedic Center, Chappal Road,\nHyderabad.","10-Aug-2007","2873/LC.B/2007","Orhopedics","9-Aug-2010"]
[null,451,"Universal Super Speciality Dental Hospital,\nMotinagar X Roads, Plot No. 13-E, 2nd floor,\nKalyananagar, Housing Co-operative Society,\nVenture No.3, Hyderabad","2009-12-08","19438/LC-B/2009","Dental","2012-12-07","Universal Super Speciality Dental Hospital,\nMotinagar X Roads, Plot No. 13-E, 2nd floor,\nKalyananagar, Housing Co-operative Society,\nVenture No.3, Hyderabad","2009-12-08","19438/LC-B/2009","Dental","2012-12-07"]
[null,452,"Usha Cardiac Centre Ltd., 39-2-11, Pitchaiah\nStreet, M.G.Road, Labbipet, Vijayawada.","2006-01-19","18529/LC-B/2005","Cardiology, C.T.Surgery, General\n Medicine and Pulmonology","2012-01-18","Usha Cardiac Centre Ltd., 39-2-11, Pitchaiah\nStreet, M.G.Road, Labbipet, Vijayawada.","2006-01-19","18529/LC-B/2005","Cardiology, C.T.Surgery, General\n Medicine and Pulmonology","2012-01-18"]
[null,453,"Usha Mullapudi Cardiac Centre,\nGajularamaram, Qutubullahpur Municipality,\nR.R.District, Hyderabad.","2006-02-23","18504/LC-B/2005","Cardiology","2012-02-22","Usha Mullapudi Cardiac Centre,\nGajularamaram, Qutubullahpur Municipality,\nR.R.District, Hyderabad.","2006-02-23","18504/LC-B/2005","Cardiology","2012-02-22"]
[null,454,"Vamsi Krishna Dental Hospital, 3/27,\nR.S.Road, Near Saibaba Theatre, Opp. Petrol\nPump, Kadapa","30-Jul-2010","19608/LC-B/2010","Dental","29-Jul-2013","Vamsi Krishna Dental Hospital, 3/27,\nR.S.Road, Near Saibaba Theatre, Opp. Petrol\nPump, Kadapa","30-Jul-2010","19608/LC-B/2010","Dental","29-Jul-2013"]
[null,455,"Vamsi Multispciality Dental Hospital, 102-104,\nIst Floor, Agraj Plaza, Main Road, R.R. Pet,\nEluru, W.G. Dist.","2007-05-11","20699/LC.B/2006","Dental","2013-05-10","Vamsi Multispciality Dental Hospital, 102-104,\nIst Floor, Agraj Plaza, Main Road, R.R. Pet,\nEluru, W.G. Dist.","2007-05-11","20699/LC.B/2006","Dental","2013-05-10"]
[null,456,"Vasavi ENT & Cancer Institute, 6-1-91, Opp.\nMeera Theatre, Lakdikapool, Hyderabad -\n500004.","17-Feb-2007","18625/LC-B/2005","ENT","16-Feb-2010","Vasavi ENT & Cancer Institute, 6-1-91, Opp.\nMeera Theatre, Lakdikapool, Hyderabad -\n500004.","17-Feb-2007","18625/LC-B/2005","ENT","16-Feb-2010"]
[null,457,"Vasavi Medical and Research Center, 6-1-\n91, Opp. Meera Theatre, Khairatabad,\nHyderabad","2008-03-07","3762/LC.B/2006","Anaesthesiology, Emergency\n Medicine, Genl. Medicine, Genl.\n Surgery, Neuro Surgery, Orthopedics,\n Pathology, Pulmonology, Surgical\n Gastroenterology, Urology, Dialysis\n Unit, Cardiology, Nephrology, OBG.,\n Pediatrics, Plastic Surgery, Radiology,\n Surgical Oncology","2011-03-06","Vasavi Medical and Research Center, 6-1-\n91, Opp. Meera Theatre, Khairatabad,\nHyderabad","2008-03-07","3762/LC.B/2006","Anaesthesiology, Emergency\n Medicine, Genl. Medicine, Genl.\n Surgery, Neuro Surgery, Orthopedics,\n Pathology, Pulmonology, Surgical\n Gastroenterology, Urology, Dialysis\n Unit, Cardiology, Nephrology, OBG.,\n Pediatrics, Plastic Surgery, Radiology,\n Surgical Oncology","2011-03-06"]
[null,458,"Vasvi Eye Hospital, 5-7-17, Khaleelwadi,\nNizamabad.","2007-04-28","25597/LC-B/2006","Ophthalmology ( for Anterior Segment\n diseases only )","2013-04-27","Vasvi Eye Hospital, 5-7-17, Khaleelwadi,\nNizamabad.","2007-04-28","25597/LC-B/2006","Ophthalmology ( for Anterior Segment\n diseases only )","2013-04-27"]
[null,459,"Veena Medicares, 6-2-103, Kakati Colony,\nHanamkonda, Warangal Dist.","24-Apr-2010","48774/LC-B/2009","Orthopaedics","23-Apr-2013","Veena Medicares, 6-2-103, Kakati Colony,\nHanamkonda, Warangal Dist.","24-Apr-2010","48774/LC-B/2009","Orthopaedics","23-Apr-2013"]
[null,460,"Venkata Ramana Nursing Home (P) Ltd.,\nOpp. RTC Bus Stand, Kurnool Road, Ongole,\nPrakasam Dist.","3-Jul-2010","13378/LC-B/2010","General Medicine, General Surgery,\n OBG, Paediatrics, Orthopadics and\n Neuro Surgery","2-Jul-2013","Venkata Ramana Nursing Home (P) Ltd.,\nOpp. RTC Bus Stand, Kurnool Road, Ongole,\nPrakasam Dist.","3-Jul-2010","13378/LC-B/2010","General Medicine, General Surgery,\n OBG, Paediatrics, Orthopadics and\n Neuro Surgery","2-Jul-2013"]
[null,461,"Venkata Sai Multi SpecialtyDental Hospital,\nGandhi Nagar, Kurnool.","15-Sep-2008","1020/LC.B/2008","Dental","14-Sep-2011","Venkata Sai Multi SpecialtyDental Hospital,\nGandhi Nagar, Kurnool.","15-Sep-2008","1020/LC.B/2008","Dental","14-Sep-2011"]
[null,462,"Venkatapadma Hospitals, 15-1-45, Three\nLamps Junction, Beside Masjid, Vizianagaram","2010-02-18","34435/LC-B/2009","General Medicine, General Surgery,\n Anaesthesiology, OBG, Orthopaedics,\n Neuro Surgery, ENT, Urology,\n Paediatrics, Radiology, Pathology,\n Plastic Surgery, Pulmonoogy and\n Physiotherapy","2013-02-17","Venkatapadma Hospitals, 15-1-45, Three\nLamps Junction, Beside Masjid, Vizianagaram","2010-02-18","34435/LC-B/2009","General Medicine, General Surgery,\n Anaesthesiology, OBG, Orthopaedics,\n Neuro Surgery, ENT, Urology,\n Paediatrics, Radiology, Pathology,\n Plastic Surgery, Pulmonoogy and\n Physiotherapy","2013-02-17"]
[null,463,"Venkateswara KidneyCenter, Ambedkar\nRoad, Karimnagar.","2008-08-08","4553/LC.B/2008","Genl. Medicine, Genl. Surgery,\n Urology, Nephrology, Anaesthesiology,\n Orthopedics, OBG., ENT, Neuro\n Surgery and Pediatrics","2011-08-07","Venkateswara KidneyCenter, Ambedkar\nRoad, Karimnagar.","2008-08-08","4553/LC.B/2008","Genl. Medicine, Genl. Surgery,\n Urology, Nephrology, Anaesthesiology,\n Orthopedics, OBG., ENT, Neuro\n Surgery and Pediatrics","2011-08-07"]
[null,464,"Viaya Eye Hospital, 4/624, Gandhi Road,\nProddutur, Kadapa Dist.","12-Mar-2010","29263/LC-B/2009","Ophthalmology","11-Mar-2013","Viaya Eye Hospital, 4/624, Gandhi Road,\nProddutur, Kadapa Dist.","12-Mar-2010","29263/LC-B/2009","Ophthalmology","11-Mar-2013"]
[null,465,"Vijaya Eye Hospital, 5-8-104, Lakshimpuram,\nMain Road, Guntur","2007-07-27","23865/LC-B/2006","Opthalomology","2013-05-10","Vijaya Eye Hospital, 5-8-104, Lakshimpuram,\nMain Road, Guntur","2007-07-27","23865/LC-B/2006","Opthalomology","2013-05-10"]
[null,466,"Vijaya Health Care Centre,8-2-\n86,Kummariguda, Near Passport office,\nSecunderabad.","2005-10-24","18755/LC-B/2005","Multi","2009-02-18","Vijaya Health Care Centre,8-2-\n86,Kummariguda, Near Passport office,\nSecunderabad.","2005-10-24","18755/LC-B/2005","Multi","2009-02-18"]
[null,467,"Vijaya Hospital R.R.Pet. Eluru","7-Jul-2009","36792/LC-B/2008","Ophthalmology","6-Jul-2012","Vijaya Hospital R.R.Pet. Eluru","7-Jul-2009","36792/LC-B/2008","Ophthalmology","6-Jul-2012"]
[null,468,"Vijaya Hospital, Raghava Cine Complex\nRoad, Pogathota, Nellore.","6-Nov-2007","7284/LC.B/2002","Urology.","5-Nov-2010","Vijaya Hospital, Raghava Cine Complex\nRoad, Pogathota, Nellore.","6-Nov-2007","7284/LC.B/2002","Urology.","5-Nov-2010"]
[null,469,"Vijaya Hospital, Revenue Colony, Nandyal\nRoad, Kurnool.","2009-01-16","14490/LC.B/2007","Genl. Medicine, Genl. Surgery,\n Surgical Gastro-enterology, Cardiology,\n Nephrology, Neuro Surgery,\n Orthopedics, Pediatrics, E.N.T., OBG.,\n Plastic Surgery and Physiotherapy.","2012-01-15","Vijaya Hospital, Revenue Colony, Nandyal\nRoad, Kurnool.","2009-01-16","14490/LC.B/2007","Genl. Medicine, Genl. Surgery,\n Surgical Gastro-enterology, Cardiology,\n Nephrology, Neuro Surgery,\n Orthopedics, Pediatrics, E.N.T., OBG.,\n Plastic Surgery and Physiotherapy.","2012-01-15"]
[null,470,"Vijaya Super Speciality Dental Hospital, opp.\nRama Talkies, C.B.M. Compound,\nVisakhapatnam.","10-Aug-2007","20971/LC.B/2006","Dental","9-Aug-2010","Vijaya Super Speciality Dental Hospital, opp.\nRama Talkies, C.B.M. Compound,\nVisakhapatnam.","10-Aug-2007","20971/LC.B/2006","Dental","9-Aug-2010"]
[null,471,"Vijaya Super Spesciality Dental Hospital &\nMaxillofacial Trauma Care Centre, 75-8-2,\nGandhipuram-II, Beside RajahmundryGas\nCompany, Rajahmundry, E.G.Dist.","2009-10-24","28846/LC-B/2009","Dental","2012-10-23","Vijaya Super Spesciality Dental Hospital &\nMaxillofacial Trauma Care Centre, 75-8-2,\nGandhipuram-II, Beside RajahmundryGas\nCompany, Rajahmundry, E.G.Dist.","2009-10-24","28846/LC-B/2009","Dental","2012-10-23"]
[null,472,"Vijetha Hospital, Suryaraopet, Eluru Road,\nVijayawada","2006-05-06","4706/LC.B/2006","Anaesthesiology, Cardiology,\n C.T.Surgery, ENT, Emergency\n Medicine, General Medicine, General\n Surgery, Nephrology, Neuro Surgery,\n OBG, Orthopaedics, Paediatrics,\n Pathology, Plastic Surgery,\n Pulmonology, Radiology, Surgical\n Gastroentesrology, Surgical Oncology,\n Urology, Physiotherapy Unit and\n Dialysis","2012-05-05","Vijetha Hospital, Suryaraopet, Eluru Road,\nVijayawada","2006-05-06","4706/LC.B/2006","Anaesthesiology, Cardiology,\n C.T.Surgery, ENT, Emergency\n Medicine, General Medicine, General\n Surgery, Nephrology, Neuro Surgery,\n OBG, Orthopaedics, Paediatrics,\n Pathology, Plastic Surgery,\n Pulmonology, Radiology, Surgical\n Gastroentesrology, Surgical Oncology,\n Urology, Physiotherapy Unit and\n Dialysis","2012-05-05"]
[null,473,"Vinod Dental Super SpecialtyHospital, 46-\n679, 1st Floor, Beside Hotel Laxmi Nivas,\nBudhvarpet, Kurnool","20-Mar-2009","192/LC.B/2009","Dental","2012-03-19","Vinod Dental Super SpecialtyHospital, 46-\n679, 1st Floor, Beside Hotel Laxmi Nivas,\nBudhvarpet, Kurnool","20-Mar-2009","192/LC.B/2009","Dental","2012-03-19"]
[null,474,"Vision Care Clinic and Eye Hospital, 6-2-88\nOld Maty. Hosptial Raod, Bhavani Nagar\nCircle, Tirupathi","18-Feb-2009","3848/LC.B/2008","Ophthalmology","17-Feb-2012","Vision Care Clinic and Eye Hospital, 6-2-88\nOld Maty. Hosptial Raod, Bhavani Nagar\nCircle, Tirupathi","18-Feb-2009","3848/LC.B/2008","Ophthalmology","17-Feb-2012"]
[null,475,"Viswa Bharathi Cancer Hospital, R.T.Nagar,\nNear Nagalapuram, Kurnool","29-Aug-2009","19382/LC-B/2009","Cancer","28-Aug-2012","Viswa Bharathi Cancer Hospital, R.T.Nagar,\nNear Nagalapuram, Kurnool","29-Aug-2009","19382/LC-B/2009","Cancer","28-Aug-2012"]
[null,476,"Viswa Bharati Super Speciality Hospital,\nGayatri Estates, Kurnool","5-Dec-2005","18538/LC-B/2005","Multi"," 04-12-2011","Viswa Bharati Super Speciality Hospital,\nGayatri Estates, Kurnool","5-Dec-2005","18538/LC-B/2005","Multi"," 04-12-2011"]
[null,477,"Vivekananda Hospital, Greenlands Road,\nBegumpet, Hyderabad.","2007-11-06","8577/LC.B/2007","Anathesiology, General Medicine,\n General Surgery, E.N.T., Emergency\n Medicine, Nephrology, Neuro Surgery,\n OBG., Orthopedics, Pediatrics, Plastic\n Surgery, Pulmanology, Radiology,\n Surgical Gastro Enterology, Surgical\n Oncology and Physio Therapy Unit.","2010-11-05","Vivekananda Hospital, Greenlands Road,\nBegumpet, Hyderabad.","2007-11-06","8577/LC.B/2007","Anathesiology, General Medicine,\n General Surgery, E.N.T., Emergency\n Medicine, Nephrology, Neuro Surgery,\n OBG., Orthopedics, Pediatrics, Plastic\n Surgery, Pulmanology, Radiology,\n Surgical Gastro Enterology, Surgical\n Oncology and Physio Therapy Unit.","2010-11-05"]
[null,478,"Vizag Hospital and cancer Research Centre\nPrivate Limtied, 1/7, M.V.P. Colony,\nVisakhapatnam","2009-05-25","36818/LC.B/2008","Cancer","24-May-2012","Vizag Hospital and cancer Research Centre\nPrivate Limtied, 1/7, M.V.P. Colony,\nVisakhapatnam","2009-05-25","36818/LC.B/2008","Cancer","24-May-2012"]
[null,479,"VRLS Memorial Neuro Hospital, D.No. 39-\n17/1A, Sivananda Vari Street, M.G.Road,\nLabbipet, Vijayawada","7-Aug-2010","45945/LC-B/2010","Orthopaedics, Neuro Surgery and ENT","6-Aug-2013","VRLS Memorial Neuro Hospital, D.No. 39-\n17/1A, Sivananda Vari Street, M.G.Road,\nLabbipet, Vijayawada","7-Aug-2010","45945/LC-B/2010","Orthopaedics, Neuro Surgery and ENT","6-Aug-2013"]
[null,480,"Warangal Hospitals, 11-23-890, Narasampet\nRoad, Pochamma Maidan, Warangal.","2008-04-30","8372/LC.B/2008","General Medicine, Genl. Surgery,\n Pulmonology, Gastroenterology,\n Pediatrics, Laproscopic Surgery, Neuro\n Surgery, Plastic Surgery, Urology,\n Surgical Oncology, E.N.T.,\n Orthopedics, OBG., Radiology,\n Pathology and Anesthesiaology.","2011-04-29","Warangal Hospitals, 11-23-890, Narasampet\nRoad, Pochamma Maidan, Warangal.","2008-04-30","8372/LC.B/2008","General Medicine, Genl. Surgery,\n Pulmonology, Gastroenterology,\n Pediatrics, Laproscopic Surgery, Neuro\n Surgery, Plastic Surgery, Urology,\n Surgical Oncology, E.N.T.,\n Orthopedics, OBG., Radiology,\n Pathology and Anesthesiaology.","2011-04-29"]
[null,481,"Woodlands Hospital, 30-4-852, Barkatpura,\nHyderabad","2006-03-25","24870/LC-B/2005","Anaesthesiology, Cardiology,C.T.Surgery, Emergency Medicine,General Medicine, General Surgery,Nephrology, Neuro Surgery, OBG,Orthopaedics, Paediatrics,Pathology,Plastic Surgery, Pulmonology,Radiology, Urology and Surgical Gastroenterology","2012-03-24","Woodlands Hospital, 30-4-852, Barkatpura,\nHyderabad","2006-03-25","24870/LC-B/2005","Anaesthesiology, Cardiology,C.T.Surgery, Emergency Medicine,General Medicine, General Surgery,Nephrology, Neuro Surgery, OBG,Orthopaedics, Paediatrics,Pathology,Plastic Surgery, Pulmonology,Radiology, Urology and Surgical Gastroenterology","2012-03-24"]
[null,482,"Yashoda Cancer Hospital, Raj Bhavan Road,\nSomajiguda, Hyderabad","08-Dec-2009","36167/LC-B/2009","Cancer","07-Dec-2012","Yashoda Cancer Hospital, Raj Bhavan Road,\nSomajiguda, Hyderabad","08-Dec-2009","36167/LC-B/2009","Cancer","07-Dec-2012"]
[null,483,"Yashoda Hospital, 64, S.P.Road,\nSecunderabad","2006-01-03","17413/LC-B/2005","Multi","2012-01-02","Yashoda Hospital, 64, S.P.Road,\nSecunderabad","2006-01-03","17413/LC-B/2005","Multi","2012-01-02"]
[null,484,"Yashoda Suepr Speciality Hospital (A Unit of\nDatta Chandra Construction & Hospital, Pvt.\nLtd.) Malakpet, Hyderabad","2006-05-06","18531/LC.B/2005","Multi","2012-05-05","Yashoda Suepr Speciality Hospital (A Unit of\nDatta Chandra Construction & Hospital, Pvt.\nLtd.) Malakpet, Hyderabad","2006-05-06","18531/LC.B/2005","Multi","2012-05-05"]
[null,485,"Yashoda Super Speciality Hospital, Raj\nBhavan Road, Somajiguda, Hyderabad","2006-04-06","18532/LC-B/2005","Anaesthesiology, Cardiology, C.T.Surgery, ENT, Emergency Medicine, General Medicine, General Surgery, Nephrology, Neuro Surgery, Nuclear Medicine, OBG,Orthopaedics,\n Paediatrics, Pathology, Plastic\n Surgery, Pulmonology, Radiology,\n Surgical Gastroenterology, Surgical\n Oncology, Urology Physiotherapy and\n Dialysis","2012-04-05","Yashoda Super Speciality Hospital, Raj\nBhavan Road, Somajiguda, Hyderabad","2006-04-06","18532/LC-B/2005","Anaesthesiology, Cardiology, C.T.Surgery, ENT, Emergency Medicine, General Medicine, General Surgery, Nephrology, Neuro Surgery, Nuclear Medicine, OBG,Orthopaedics,\n Paediatrics, Pathology, Plastic\n Surgery, Pulmonology, Radiology,\n Surgical Gastroenterology, Surgical\n Oncology, Urology Physiotherapy and\n Dialysis","2012-04-05"]

{"sheet":"Code","index":4,"n_rows":487,"n_cols":47,"rows_kept":487,"cut":false,"hidden":true,"merged":[[43,5,43,6],[44,5,44,6],[45,5,45,6],[46,5,46,6],[47,5,47,6],[24,34,24,35],[25,34,25,35],[26,2,26,3],[15,28,17,32],[4,6,4,7],[10,4,10,5],[10,6,10,7],[25,6,25,7],[25,28,28,32],[28,14,28,15],[15,22,15,24],[16,24,16,26],[26,34,26,35],[15,34,17,39],[19,34,23,39],[18,28,23,32],[14,41,14,46],[15,41,18,45],[19,41,20,45],[21,41,27,45],[15,46,20,50],[21,46,28,51],[67,0,67,1],[0,0,0,1],[13,22,14,27],[0,11,0,12],[18,6,19,7],[0,2,0,3],[0,4,0,5],[4,4,4,5],[0,8,0,9],[28,16,28,17],[33,22,33,27],[34,22,37,27],[29,22,32,27],[28,22,28,27],[41,5,41,6],[42,5,42,6]]}
["DESIGNATION",null,"DISTRICT",null,"GENDER",null,null,null,"BASIC PAY",null,null,"LIST OF RECOGNISED HOSPITALS",null,462,{"$f":"LOOKUP(N1,L2:M487,M2:M487)","v":"Venkatapadma Hospitals, 15-1-45, Three\nLamps Junction, Beside Masjid, Vizianagaram"}]
[1,"Assistant Director",1,"Adilabad District",1,"Male",1,"Yes",1,6700,null,"S.  NO.","Name of the Hospital",null,"Emp Res",null,"Name of the Employee","Designation","Place of working","Mandal","District","Scale of Pay","Basic Pay","Add1","Add2","Add3","Add4"]
[2,"Assistant Engineer",2,"Ananthapur District",2,"Female",2,"No",2,6900,null,1,{"$f":"'Rec. Hos'!C3","v":"A.P. Super Speciality Dental Hospital PVT Ltd,Road No. 2, Banjara Hills, Hyderabad."},null,{"$f":"VLOOKUP(MAIN!G6,C61:D63,2,FALSE)","v":"Smt."},{"$f":"IF(MAIN!I6=\"\",\"\",MAIN!I6)","v":"G.Saivijaya Kumar"},{"$f":"CONCATENATE(O3,\" \",P3)","v":"Smt. G.Saivijaya Kumar"},{"$f":"VLOOKUP(MAIN!G7,Code!A2:B50,2,FALSE)","v":"School Assistant (English)"},{"$f":"IF(MAIN!G8=\"\",\"\",MAIN!G8)","v":"ZPP. High School, Balayapalli"},{"$f":"IF(MAIN!G9=\"\",\"\",CONCATENATE(MAIN!G9,\" Mandal\"))","v":"Balayapalli Mandal"},{"$f":"VLOOKUP(MAIN!G10,C2:D24,2,FALSE)","v":"Medak District"},{"$f":"VLOOKUP(MAIN!G11,Code!C28:D59,2,FALSE)","v":"23650-49360"},{"$f":"VLOOKUP(MAIN!G12,I2:J135,2,FALSE)","v":17540},{"$f":"IF(MAIN!G13=\"\",\"\",MAIN!G13)","v":"7-197,PS street"},{"$f":"IF(MAIN!G14=\"\",\"\",MAIN!G14)","v":"Venkatagiri"},{"$f":"IF(MAIN!G15=\"\",\"\",MAIN!G15)","v":""},{"$f":"IF(MAIN!J16=\"\",\"\",CONCATENATE(\"PIN -  \",MAIN!J16))","v":""}]
[3,"Asst. Commissioner for Govt. Exams",3,"SPSR Nellore District",null,null,null,null,3,7100,null,2,{"$f":"'Rec. Hos'!C4","v":"A.P.Super Speciality Dental Hospital, Plot No.265J, Road No.10, Jubilee Hills, Hyderabad"},null,null,null,null,null,null,null,{"$f":"VLOOKUP(MAIN!G10,A101:C123,3,FALSE)","v":"Sanga Reddy"},{"$f":"CONCATENATE(V3,\"  /  \",W3)","v":"23650-49360  /  17540"}]
[4,"Asst. Section Officer",4,"Chittoor District","TYPE OF RESIDENCE",null,"HRA PERCENTAGE",null,4,7300,null,3,{"$f":"'Rec. Hos'!C5","v":"A.V.R. Dento - Facial Hospital, Street No. 8\nHabshiguda, Hyderabad."}]
[5,"Asst. Statistical Officer",5,"East Godavari District",1,"Govt. Quarters",1,10,5,7520,null,4,{"$f":"'Rec. Hos'!C6","v":"Aayushman Hospital, Srirangam Street, Near\nVenkateswara Cology, Kurnool"}]
[6,"Auditor",6,"Guntur District",2,"Own House",2,12.5,6,7740,null,5,{"$f":"'Rec. Hos'!C7","v":"Abhilash Netra Vydyasala, 3/1350, Gandhi\nRoad, Opp. Ishwarya Complex, Proddutur,\nKadapa Dist."},null,null,null,"Name of the Patient","Relationship with Emp","Age of Patient","Name of the Hospital","Name of the Treatment","Amount in Figures","Amount in Words","Date of Joining","Date of Discharge","Date of submission of Proposal to DDO"]
[7,"Cashier",7,"Hyderabad District",3,"Rented House",3,20,7,7960,null,6,{"$f":"'Rec. Hos'!C8","v":"Aditya Hospital, 4-1-16, Boggulakunta, Tilak\nRoad, Abids, Hyderabad."},null,{"$f":"VLOOKUP(MAIN!#REF!,C65:D71,2,FALSE)","v":{"$error":"#REF!"}},{"$f":"IF(MAIN!R6=\"\",\"\",MAIN!R6)","v":"G.padmavathamma"},{"$f":"CONCATENATE(O8,\" \",P8)","v":{"$error":"#REF!"}},{"$f":"VLOOKUP(MAIN!W7,A56:B66,2,FALSE)","v":{"$error":"#N/A"}},{"$f":"CONCATENATE(MAIN!W8,\" Years\")","v":" Years"},{"$f":"VLOOKUP(Code!C124,L2:M160,2,FALSE)","v":"Dental Venue Multi Speciality Hospital, F-14,\nFirst Floor, Deepthi Apartments, S.P. Road,\nSecunderabad."},{"$f":"IF(MAIN!Q9=\"\",\"\",MAIN!Q9)","v":"Undrewent Phacoemulsification with IOL implementation left eye and cataract left eye"},{"$f":"IF(MAIN!Q10=\"\",\"\",MAIN!Q10)","v":2000},{"$f":"Rs!B1","v":"(Rupees   Two Thousand   and  Zero Only) "},{"$f":"IF(MAIN!W13=\"\",\"\",MAIN!W13)","v":""},{"$f":"IF(MAIN!W14=\"\",\"\",MAIN!W14)","v":""},{"$f":"IF(MAIN!W15=\"\",\"\",MAIN!W15)","v":""}]
[8,"Deputy Director",8,"Kareemnagar District",null,null,4,30,8,8200,null,7,{"$f":"'Rec. Hos'!C9","v":"Aditya Hospital, Opp. Police Parade Grounds\nBus Stop, Near Petrol Pump, Hanumakonda,\nWarangal."},null,null,null,null,null,{"$f":"MAIN!W8","v":0},"Category of Hospital"]
[9,"Deputy Educational Officer",9,"Khammam District",null,null,null,null,9,8440,null,8,{"$f":"'Rec. Hos'!C10","v":"Advally Damodar Reddy Memorial Hospital, 9-2, Ramanthapur, Hyderabad"},null,null,null,null,null,null,{"$f":"VLOOKUP(MAIN!W10,C74:D75,2,FALSE)","v":{"$error":"#N/A"}}]
[10,"Deputy Inspector of Schools",10,"Krishna District","MONTHS",null,"C.C.A",null,10,8680,null,9,{"$f":"'Rec. Hos'!C11","v":"Akira Eye Hospital, Aryapuram, Rajahmundry,E.G. Dist."}]
[11,"District B.C. Welfare Officer",11,"Kurnool District",1,"Not Applicable",1,"Not Applicable",11,8940,null,10,{"$f":"'Rec. Hos'!C12","v":"Alluri Sitarama Raju Academy of Medical\nSciences and Hospital, N.H. 5, Malkapuram,\nEluru, W.G. Dist."},null,null,null,"Name of the DDO","Designation","Place of working","Mandal","District",null,null,{"$f":"IF($D$64=\"Sri.\",\"he\",\"she\")","v":"he"},{"$f":"IF($F$65=\"Sri.\",\"he\",\"she\")","v":"she"}]
[12,"District Educational Officer",12,"Mahboobnagar District",2,"2010-03-10",2,"GHMC",12,9200,null,11,{"$f":"'Rec. Hos'!C13","v":"Alpha Hospital, 23-1-863, Near MCH\nSwimmingpool, Moghalpura, Hyderabad"},null,{"$f":"VLOOKUP(MAIN!#REF!,C61:D63,2,FALSE)","v":{"$error":"#REF!"}},{"$f":"IF(MAIN!#REF!=\"\",\"\",MAIN!#REF!)","v":{"$error":"#REF!"}},{"$f":"CONCATENATE(O13,\" \",P13)","v":{"$error":"#REF!"}},{"$f":"VLOOKUP(MAIN!Q19,A69:B80,2,FALSE)","v":{"$error":"#N/A"}},{"$f":"IF(MAIN!V19=\"\",\"\",MAIN!V19)","v":"ZPPHS,Balayapalli"},{"$f":"IF(MAIN!G20=\"\",\"\",CONCATENATE(MAIN!G20,\" Mandal\"))","v":"District Mandal"},{"$f":"VLOOKUP(MAIN!T20,C2:D24,2,FALSE)","v":{"$error":"#N/A"}},null,null,{"$f":"IF(D64=\"Sri.\",\"his\",\"her\")","v":"his"},{"$f":"IF(D64=\"Sri.\",\"him\",\"her\")","v":"him"},{"$f":"CONCATENATE(V8,\"-00\")","v":"2000-00"},{"$f":"CONCATENATE(\"from \",TEXT(X8,\"dd-mm-yyyy\"),\" to \",TEXT(Y8,\"dd-mm-yyyy\"))","v":"from  to "}]
[13,"District Tribal Welfare Officer",13,"Medak District",3,"2010-04-10",3,"GVMC",13,9460,null,12,{"$f":"'Rec. Hos'!C14","v":"Amaravathi Institute of Medical Science Pvt.\nLtd., Kothapet, Guntur"},null,null,null,null,2,null,{"$f":"IF(V8<=25000,1,2)","v":1},null,null,{"$f":"CONCATENATE(\"                With reference to the subject cited, I submit herewith the Medical Bills with all the enclosures submitted by \",UPPER(R30),\", \",R31,\", \",R32,\", \",R33,\", \",R34,\" for your kind sanction of the Medical Reimbursement for an amount of Rs. \")","v":"                With reference to the subject cited, I submit herewith the Medical Bills with all the enclosures submitted by SRI. G.SAIVIJAYA KUMAR, School Assistant (Phy. Edn.), ZPP. High School, Balayapalli, Jammikunta, Kareemnagar District  for your kind sanction of the Medical Reimbursement for an amount of Rs. "}]
[14,"Divisional Engineer",14,"Nalgonda District",4,"2010-05-10",4,"Vijayawada",14,9740,null,13,{"$f":"'Rec. Hos'!C15","v":"Ameerpet Super Speciality Dental Hospital &\nImplant Centre, 102 Classic Avenue, 6-3-\n790/7, Behind chowdary Mansion, Ameerpet,\nHyderabad."},null,{"$f":"IF(O13=\"Sri.\",\"Sir\",\"Madam\")","v":{"$error":"#REF!"}},null,null,{"$f":"CONCATENATE(\"The \",R13,\",                                               \",Mandals1!AD2,\",                               \",Mandals1!Z1,\".\")","v":{"$error":"#N/A"}},{"$f":"CONCATENATE(\"The \",R13,\",                                       \",S13,\",                               \",T13,\",                           \",U13,\".\")","v":{"$error":"#N/A"}},{"$f":"CONCATENATE(\"The District Educational Officer,\",\"                                         \",R34,\".\")","v":"The District Educational Officer,                                         Kareemnagar District ."},{"$f":"CONCATENATE(\"The Commissioner & Director of\",\"                                           School Education, Andhra Pradesh\",\",                                                         \",\"Hyderabad.\")","v":"The Commissioner & Director of                                           School Education, Andhra Pradesh,                                                         Hyderabad."},null,null,null,null,null,null,null,null,null,null,null,null,null,null,null,null,null,null,null,null,"Non Drawl Certificate"]
[15,"Executive Engineer",15,"Nizamabad District",5,"2010-06-10",5,"Other MC",15,10020,null,14,{"$f":"'Rec. Hos'!C16","v":"American Institute of Dentistry, Besides\nChermas, 8-3-944/12/4, Ameerpet,\nHyderabad."},null,null,null,null,null,null,null,null,null,{"$f":"\" as \"&\" \"&X13&\" \"&B55&\" \"& F65&\" G.PADMAVATHAMMA who is wholly dependent on \"&Y13&\"  has \"","v":" as  his self Smt. G.PADMAVATHAMMA who is wholly dependent on him  has "},null,null,null,null,null,{"$f":"CONCATENATE(Z13,W8,\" \",\"as \",X12,\" undergone Treatment for desease \",UPPER(U8),\" in the Recognised Hopital by the Andhra Pradesh State Government i.e., at \",UPPER(T8),\" during the period \",AA13,\" and onward transmit to the higher authorities for further necessary action at an early date.\")","v":"2000-00(Rupees   Two Thousand   and  Zero Only)  as he undergone Treatment for desease UNDREWENT PHACOEMULSIFICATION WITH IOL IMPLEMENTATION LEFT EYE AND CATARACT LEFT EYE in the Recognised Hopital by the Andhra Pradesh State Government i.e., at DENTAL VENUE MULTI SPECIALITY HOSPITAL, F-14,\nFIRST FLOOR, DEEPTHI APARTMENTS, S.P. ROAD,\nSECUNDERABAD. during the period from  to  and onward transmit to the higher authorities for further necessary action at an early date."},null,null,null,null,null,{"$f":"CONCATENATE(\"               With reference to the subject cited, I submit here with the Medical Bills with all the enclosures for Medical Reimbursement for an amount of Rs. \",Z13,\"  \",W8,\" only)\",\" as my \",R8,\" named \",UPPER(Q8),\" who is wholly dependent on me has undergone Treatment for the desease \",UPPER(U8),\" in the Recognised Hospital by the Andhra Pradesh State Government i.e., at \",UPPER(T8),\" during the period \",AA13,\" and onward transmit to the higher authorities for further necessary action in the matter at an early date.\")","v":{"$error":"#N/A"}},null,null,null,null,null,null,{"$f":"CONCATENATE(\"              This is to certify that, the amount of Rs. \",Z13,\" \",W8,\" only) is being claimed now in this bill by \",UPPER(Q3),\", \",R3,\", \",S3,\", \",T3,\", \",U3,\" has not been paid previusly towards Medical Reimbursement in respect of \",X13,\" \",R8,\" \",\" named \",UPPER(Q8),\" age \",\"(\",MAIN!W8,\")\",\" Years\",\" who has undergone the Treatment for the desease \",UPPER(U8),\" during the period \",AA13)","v":{"$error":"#N/A"}},null,null,null,null,{"$f":"CONCATENATE(\"               This is to certify that, the amount of Rs. \",Z13,\"  \",W8,\" only) is being claimed now in this bill by \",UPPER(Q3),\", \",R3,\", \",S3,\", \",T3,\", \",U3,\" has not been paid previously towards Medical Reimbursement in respect of \",UPPER(Q3), \" (Self), age \",\"(\",S9,\")\",\" who has undergone the Treatment for the desease \",UPPER(U8),\" during the period \",AA13,\" in the Recognised Hospital By the Andhra Pradesh State Government i.e., at \",UPPER(T8),\" as per the records available regarding the Medical Reimbursement defined under the Government Medical Attendance Rules, 1972\")","v":"               This is to certify that, the amount of Rs. 2000-00  (Rupees   Two Thousand   and  Zero Only)  only) is being claimed now in this bill by SMT. G.SAIVIJAYA KUMAR, School Assistant (English), ZPP. High School, Balayapalli, Balayapalli Mandal, Medak District has not been paid previously towards Medical Reimbursement in respect of SMT. G.SAIVIJAYA KUMAR (Self), age (0) who has undergone the Treatment for the desease UNDREWENT PHACOEMULSIFICATION WITH IOL IMPLEMENTATION LEFT EYE AND CATARACT LEFT EYE during the period from  to  in the Recognised Hospital By the Andhra Pradesh State Government i.e., at DENTAL VENUE MULTI SPECIALITY HOSPITAL, F-14,\nFIRST FLOOR, DEEPTHI APARTMENTS, S.P. ROAD,\nSECUNDERABAD. as per the records available regarding the Medical Reimbursement defined under the Government Medical Attendance Rules, 1972"}]
[16,"Gazetted H.M. Gr-I ",16,"Prakasham District",6,"2010-07-10",null,null,16,10300,null,15,{"$f":"'Rec. Hos'!C17","v":"Amma Hospital, Madhava Nagar, Beside Siva\nRamalayam, Nandyal Road, Kurnool"},null,null,null,"ENCLOSURES",null,null,null,null,null,"Self",{"$f":"\"as \"&X12","v":"as he"},{"$f":"IF(B55=\"self\",X17,W16)","v":"as he"}]
[17,"Gazetted H.M. Gr-II ",17,"Ranga Reddy District",7,"2010-08-10",null,null,17,10600,null,16,{"$f":"'Rec. Hos'!C18","v":"Amrutha Children Nursing Home, 5-10-15,\nKishanpura, Hanamkonda, Warangal, Dist."},null,null,null,{"$f":"IF(MAIN!#REF!=FALSE,\"Not Enclosed Essentiality Certificate\",\"Essentiality Certificate\")","v":{"$error":"#REF!"}},{"$f":"IF(MAIN!#REF!=FALSE,1,2)","v":{"$error":"#REF!"}},{"$f":"IF(R18=2,\"\",Q18)","v":{"$error":"#REF!"}},{"$f":"IF(MAIN!#REF!=FALSE,\"\",\"Essentiality Certificate\")","v":{"$error":"#REF!"}}]
[18,"Joint Director",18,"Sreekakulam District",8,"2010-09-10","SURRENDER CLAIMED DAYS",null,18,10900,null,17,{"$f":"'Rec. Hos'!C19","v":"Amrutha Nursing Home, Besides Civil\nHospital, Karimnagar."},null,null,null,{"$f":"IF(MAIN!#REF!=FALSE,\"Not Enclosed Emergency Certificate\",\"Emergency Certificate\")","v":{"$error":"#REF!"}},{"$f":"IF(MAIN!#REF!=FALSE,1,2)","v":{"$error":"#REF!"}},{"$f":"IF(R19=2,\"\",Q19)","v":{"$error":"#REF!"}},{"$f":"IF(MAIN!#REF!=FALSE,\"\",\"Emergency Certificate\")","v":{"$error":"#REF!"}},null,null,"                With reference to the subject cited, I submit herewith the Medical Bills with all the enclosures submitted by KUM. G.SAIVIJAYA KUMAR, School Assistant (English), ZPP. High School, Balayapalli, Ellanthakunta, Kareemnagar District  for your kind sanction of the Medical Reimbursement for an amount of Rs. 2000-00(Rupees   Two Thousand   and  Zero Only)  as she undergone Treatment for desease UNDREWENT PHACOEMULSIFICATION WITH IOL IMPLEMENTATION LEFT EYE AND CATARACT LEFT EYE in the Recognised Hopital by the Andhra Pradesh State Government i.e., at ANDHRA HOSPITALS, CVR COMPLEX, PRAKASAM ROAD, VIJAYAWADA during the period from 28-07-2010 to 29-07-2010 and onward transmit to the higher authorities for further necessary action at an early date.",null,null,null,null,null,{"$f":"CONCATENATE(W14,AC16)","v":"                With reference to the subject cited, I submit herewith the Medical Bills with all the enclosures submitted by SRI. G.SAIVIJAYA KUMAR, School Assistant (Phy. Edn.), ZPP. High School, Balayapalli, Jammikunta, Kareemnagar District  for your kind sanction of the Medical Reimbursement for an amount of Rs. 2000-00(Rupees   Two Thousand   and  Zero Only)  as he undergone Treatment for desease UNDREWENT PHACOEMULSIFICATION WITH IOL IMPLEMENTATION LEFT EYE AND CATARACT LEFT EYE in the Recognised Hopital by the Andhra Pradesh State Government i.e., at DENTAL VENUE MULTI SPECIALITY HOSPITAL, F-14,\nFIRST FLOOR, DEEPTHI APARTMENTS, S.P. ROAD,\nSECUNDERABAD. during the period from  to  and onward transmit to the higher authorities for further necessary action at an early date."}]
[19,"Junior Assistant",19,"Vishakapatnam District",9,"2010-10-10",null,null,19,11200,null,18,{"$f":"'Rec. Hos'!C20","v":"Amulya Multi Spefciality Dental Clinic, 12-13-\n1282, Mehtab Arcade, Opp. Ganesh Temple,\nTarnaka 'X' Road, Secunderabad"},null,null,null,{"$f":"IF(MAIN!#REF!=FALSE,\"Not Enclosed Discharge Summary\",\"Discharge Summary\")","v":{"$error":"#REF!"}},{"$f":"IF(MAIN!#REF!=FALSE,1,2)","v":{"$error":"#REF!"}},{"$error":"#REF!"},{"$f":"IF(MAIN!#REF!=FALSE,\"\",\"Discharge Summary\")","v":{"$error":"#REF!"}},null,null,null,null,null,null,null,null,null,null,null,null,null,null,{"$f":"CONCATENATE(\"             With reference to the subject cited, I submit here with the Medical Bills with all the enclosures for Medical Reimbursement for an amount of Rs. \",Z13,\"  \",W8,\" only), \",\" as I have undergone Treatment for the desease \",UPPER(U8),\" in the Recognised Hospital by the Andhra Pradesh State Government i.e., at \",UPPER(T8),\" during the period \",AA13,\" and onward transmit to the higher authorities for further necessary action in the matter at an early date.\")","v":"             With reference to the subject cited, I submit here with the Medical Bills with all the enclosures for Medical Reimbursement for an amount of Rs. 2000-00  (Rupees   Two Thousand   and  Zero Only)  only),  as I have undergone Treatment for the desease UNDREWENT PHACOEMULSIFICATION WITH IOL IMPLEMENTATION LEFT EYE AND CATARACT LEFT EYE in the Recognised Hospital by the Andhra Pradesh State Government i.e., at DENTAL VENUE MULTI SPECIALITY HOSPITAL, F-14,\nFIRST FLOOR, DEEPTHI APARTMENTS, S.P. ROAD,\nSECUNDERABAD. during the period from  to  and onward transmit to the higher authorities for further necessary action in the matter at an early date."},null,null,null,null,null,null,{"$f":"CONCATENATE(\" in the Recongised Hospital by the Andhra Pradesh State Government i.e., at \",UPPER(T8),\" as per the records available regarding the Medical Reimbursement defined under the Government Medical Attendance Rules, 1972\")","v":" in the Recongised Hospital by the Andhra Pradesh State Government i.e., at DENTAL VENUE MULTI SPECIALITY HOSPITAL, F-14,\nFIRST FLOOR, DEEPTHI APARTMENTS, S.P. ROAD,\nSECUNDERABAD. as per the records available regarding the Medical Reimbursement defined under the Government Medical Attendance Rules, 1972"}]
[20,"Junior Lecturer",20,"Vizianagaram District",10,"2010-11-10",1,"Not Applicable",20,11530,null,19,{"$f":"'Rec. Hos'!C21","v":"Amulya Nursing Home, Narasaropet, Guntur\nDist."},null,null,null,{"$f":"IF(MAIN!#REF!=FALSE,\"Not Enclosed Investigation Report\",\"Investigation Report\")","v":{"$error":"#REF!"}},{"$f":"IF(MAIN!#REF!=FALSE,1,2)","v":{"$error":"#REF!"}},{"$error":"#REF!"},{"$f":"IF(MAIN!#REF!=FALSE,\"\",\"Investigation Report\")","v":{"$error":"#REF!"}}]
[21,"L.F.L. Head Master",21,"Warangal District",11,"2010-12-10",2,15,21,11860,null,20,{"$f":"'Rec. Hos'!C22","v":"Anasuya Institute of Medical Sciences,\nPogathota, Nellore."},null,null,null,{"$f":"IF(MAIN!#REF!=FALSE,\"Not Enclosed Dependent Certificate\",\"Dependent Certificate\")","v":{"$error":"#REF!"}},{"$f":"IF(MAIN!#REF!=FALSE,1,2)","v":{"$error":"#REF!"}},{"$error":"#REF!"},{"$f":"IF(MAIN!#REF!=FALSE,\"\",\"Dependent Certificate\")","v":{"$error":"#REF!"}},null,null,null,null,null,null,null,null,null,null,null,null,null,null,null,null,null,null,null,null,null,{"$f":"CONCATENATE(AP16,AP20)","v":{"$error":"#N/A"}},null,null,null,null,{"$f":"IF(R8=\"self\",AU16,AP22)","v":{"$error":"#N/A"}}]
[22,"L.F.L. Head Mistress",22,"West Godavari District",12,"2011-01-10",3,30,22,12190,null,21,{"$f":"'Rec. Hos'!C23","v":"Andhra Hospitals, CVR Complex, Prakasam\nRoad, Vijayawada"},null,null,null,{"$f":"IF(MAIN!#REF!=FALSE,\"Not Enclosed Medical Bills\",\"Medical Bills\")","v":{"$error":"#REF!"}},{"$f":"IF(MAIN!#REF!=FALSE,1,2)","v":{"$error":"#REF!"}},{"$error":"#REF!"},{"$f":"IF(MAIN!#REF!=FALSE,\"\",\"Medical Bills\")","v":{"$error":"#REF!"}}]
[23,"Language Pandit",23,"YSR Kadapa District",13,"2011-02-10",null,null,23,12550,null,22,{"$f":"'Rec. Hos'!C24","v":"Ankith Multi SpecialtyHospital, Ibrahim\nPatnam, R.R. Dist."},null,null,null,{"$f":"IF(MAIN!#REF!=FALSE,\"Not Enclosed Check List\",\"Checklist\")","v":{"$error":"#REF!"}},{"$f":"IF(MAIN!#REF!=FALSE,1,2)","v":{"$error":"#REF!"}},{"$error":"#REF!"},{"$f":"IF(MAIN!#REF!=FALSE,\"\",\"Check List\")","v":{"$error":"#REF!"}}]
[24,"Language Pandit (Hindi)",null,null,null,null,null,null,24,12910,null,23,{"$f":"'Rec. Hos'!C25","v":"Anupama Hospital, 16-31/494 & 495, 6th\nPhase, KPHB Colony, JNTU Road,\nKukatpally, Hyderabad"},null,null,null,{"$f":"IF(MAIN!#REF!=FALSE,\"Not Enclosed Non-Drawl Certificate\",\"Non-Drawl Certificate\")","v":{"$error":"#REF!"}},{"$f":"IF(MAIN!#REF!=FALSE,1,2)","v":{"$error":"#REF!"}},{"$error":"#REF!"},{"$f":"IF(MAIN!#REF!=FALSE,\"\",\"Non-Drawl Certificate\")","v":{"$error":"#REF!"}}]
[25,"Language Pandit (Sanskrit)",null,null,null,null,"CPS",null,25,13270,null,24,{"$f":"'Rec. Hos'!C26","v":"Aparna Hospitals Pvt. Ltd., 2-5-680,\nSubhedari, Hanumakonda, Warangal"},null,null,null,"SUM",{"$f":"SUM(R18:R25)","v":{"$error":"#REF!"}},null,null,null,null,null,null,null,null,null,null,{"$f":"IF(R8=\"self\",AC19,W19)","v":{"$error":"#N/A"}},null,null,null,null,null,"as I have undergone Treatment for the desease",null,{"$f":"$B$55","v":"self"},{"$f":"IF(AK26=\"self\",AI26,AI27)","v":"as I have undergone Treatment for the desease"}]
[26,"Language Pandit (Tamil)","SCALE OF PAY",null,null,null,1,"Yes",26,13660,null,25,{"$f":"'Rec. Hos'!C27","v":"Apex Hosptials, 75-6-23, Prakash Nagar,\nRajahmundry, E.G. Dist."},null,null,null,null,{"$f":"IF(R26=16,\"\",\"CAUTION: You have to enclose all the Documents to your Medical Bill which are mentioned above.\")","v":{"$error":"#REF!"}},null,null,null,null,null,null,null,null,null,null,null,null,null,null,null,null,{"$f":"CONCATENATE(\" as my \",AK26,\" named \",F65,\" \",UPPER(MAIN!R6),\" who is wholly dependent on me has undergone Treatment for the desease\")","v":" as my self named Smt. G.PADMAVATHAMMA who is wholly dependent on me has undergone Treatment for the desease"}]
[27,"Language Pandit (Telugu)",1,"6700-20110",null,null,2,"No",27,14050,null,26,{"$f":"'Rec. Hos'!C28","v":"Apollo DRDO Hospital, DRML 'X' Road,\nKanchanbagh, Hyderabad"},null,10]
[28,"Language Pandit (Urdu)",2,"6900-20680",null,null,null,null,28,14440,null,27,{"$f":"'Rec. Hos'!C29","v":"Apollo Hospital, Jublee Hills, Hyderabad"},null,"DDO Address",null,"Employee Address",null,null,null,null,null,"DEPENDENT CERTIFICATE"]
[29,"Mandal Educational Officer",3,"7100-21250",null,"5470-12385",null,null,29,14860,null,28,{"$f":"'Rec. Hos'!C30","v":"Apollo Hospital, Vikrampuri, Secunderabad."},"name",null,null,"name",{"$f":"S30&\" \"&MAIN!I6","v":"Sri. G.Saivijaya Kumar"},{"$f":"$D$64","v":"Sri."},"The District Educational Officer",null,null,{"$f":"CONCATENATE(\"                  I\",\", \",UPPER(Q3),\", \",R3,\", \",S3,\", \",T3,\", \",U3,\", \",\" do hereby declare that, \",UPPER(Q8),\", age \",\"(\",S9,\")\",\" Years is my \",R8,\" and has no property of income of \",H97,\" own and that, \",H82,\" is wholly dependent on me only, \",H82,\" is also not a Employee or Pensioner\")","v":{"$error":"#REF!"}}]
[30,"Office Subordinate",4,"7520-22430",null,"5750-13030",null,null,30,15280,null,29,{"$f":"'Rec. Hos'!C31","v":"Apollo Hospital, Waltair Main Road,\nVisakhapatnam"},"Desig",{"$f":"LOOKUP(O28,A69:B80,B69:B80)","v":"Principal"},null,"Desig",{"$f":"$B$51","v":"School Assistant (Phy. Edn.)"}]
[31,"Physical Education Teacher",5,"7740-23040",null,"7200-16925",null,null,31,15700,null,30,{"$f":"'Rec. Hos'!C32","v":"Apollo Hospitals, D.No. 13-1-13, Main Road,\nKakinada."},"Place",{"$f":"MAIN!$V$19","v":"ZPPHS,Balayapalli"},null,"Place",{"$f":"MAIN!$G$8","v":"ZPP. High School, Balayapalli"},{"$f":"IF(MAIN!Q10>25000,Code!T31,Code!T30)","v":"The District Educational Officer"},"The Director of School Education, A.P.,"]
[32,"Principal",6,"7960-23560",null,"7385-17475",null,null,32,16150,null,31,{"$f":"'Rec. Hos'!C33","v":"Apollo Nursing Home, 3-3-96, Civil Hospital\nRoad, Karimnagar."},"Mandal",{"$f":"Mandals2!AD2","v":"Chinnamandem "},null,"Mandal",{"$f":"Mandals1!AD2","v":"Jammikunta"},null,"Near Telephone Bhavan, Saifabad,"]
[33,"Project Officer",7,"8440-24950",null,"9285-21550",null,null,33,16600,null,32,{"$f":"'Rec. Hos'!C34","v":"Apollo Reach Hospitals, Railway Station\nRoad, Karimnagar"},"DT",{"$f":"Mandals2!Z1","v":"Kaddapah District"},null,"DT",{"$f":"Mandals1!Z1","v":"Kareemnagar District "},null,"Hyderabad-500004",null,null,"AVAILMENT CERTIFICATE"]
[34,"R.J.D.S.E.",8,"9200-27000",null,"10285-24200",null,null,34,17050,null,33,{"$f":"'Rec. Hos'!C35","v":"Apple Dental Care, Opp. Vijaya Talkies,\nShanmuka Complex, Eluru Road, Vijayawada"},null,{"$f":"CONCATENATE(O30,O31,O32,O33,O34)","v":"PrincipalZPPHS,BalayapalliChinnamandem Kaddapah District"},null,null,{"$f":"CONCATENATE(R30,R31,R32,R33,R34)","v":"Sri. G.Saivijaya KumarSchool Assistant (Phy. Edn.)ZPP. High School, BalayapalliJammikuntaKareemnagar District "},null,null,null,null,{"$f":"CONCATENATE(\"                  This is to certify that\",\", \",UPPER(Q3),\",working as  \",R3,\", \",S3,\", \",T3,\", \",U3,\", \",\" He was availing medical reimbursement for second time to his mother, \",UPPER(Q8),\", age \",\"(\",S9,\")\",\" Years  on the desease of  \",UPPER(U8))","v":{"$error":"#REF!"}}]
[35,"Record Assistant",9,"9460-27700",null,"14600-29250",null,null,35,17540,null,34,{"$f":"'Rec. Hos'!C36","v":"Aravind Eye Care Centre, 20/1100, Radha\nKrishna Nagar, Lane Opp. Ramesh Theatre,\nKadapa"}]
[36,"School Assistant",10,"10020-29200",null,null,null,null,36,18030,null,35,{"$f":"'Rec. Hos'!C37","v":"Aravind Eye Hospital and Lasic Center,\nSanthosh Nagar Colony, Mehadipatnam,\nHyderabad."}]
[37,"School Assistant (Bio. Sc.)",11,"10900-31550",null,null,null,null,37,18520,null,36,{"$f":"'Rec. Hos'!C38","v":"Aravind Kidney Centre, 15/402,Brindavanam,\nMain Road, Nellore."}]
[38,"School Assistant (English)",12,"11530-33200",null,null,null,null,38,19050,null,37,{"$f":"'Rec. Hos'!C39","v":"Aravind Nethralaya Meenakshi Diabetes and\nEndocrinology and Super Speciality Hospital,\nSwathantra Park Street, Gandhi Nagar,\nNellore"}]
[39,"School Assistant (Hindi)",13,"11860-34050",null,null,null,null,39,19580,null,38,{"$f":"'Rec. Hos'!C40","v":"ARK Hospital, Kukatpally, Hyderabad."}]
[40,"School Assistant (Maths)",14,"12550-35800",null,null,null,null,40,20110,null,39,{"$f":"'Rec. Hos'!C41","v":"Arun Kidney Center, 29-23-9, Tadepallivari\nStreet, Suryaraopet, Vijayawada"}]
[41,"School Assistant (Phy. Edn.)",15,"12910-36700",1,"10900-31550",null,null,41,20680,null,40,{"$f":"'Rec. Hos'!C42","v":"Aruna Hospital, Road No. 4, Chandrapuri\nColony, L.B. Nagar, Hyderabad."}]
[42,"School Assistant (Phy. Science)",16,"13660-38570",2,"14860-39540",null,null,42,21250,null,41,{"$f":"'Rec. Hos'!C43","v":"Asha Hospitals, 7/201, Court Road,\nAnantapur."}]
[43,"School Assistant (Soc. Stu.)",17,"14860-39540",3,"18030-43630",null,null,43,21820,null,42,{"$f":"'Rec. Hos'!C44","v":"Ashok Super Speciality Dental & Orthodontic\nand Implantology Centre, Opp. K.K.Nursing\nHome, Civil Hospital Road, Karimnagar"}]
[44,"School Assistant (Telugu)",18,"15280-40510",4,"16150-42590",null,null,44,22430,null,43,{"$f":"'Rec. Hos'!C45","v":"Ashwini SpecialtyDental Hospital, Humayun\nNagar, Hyderabad"}]
[45,"School Assistant (Urdu)",19,"16150-42590",5,"18030-43630",null,null,45,23040,null,44,{"$f":"'Rec. Hos'!C46","v":"Asian Institute of Gastroenterology, 6-3-661,\nSomajiguda, Hyderabad"}]
[46,"Secondary Grade Teacher",20,"18030-43630",6,"21820-48160",null,null,46,23650,null,45,{"$f":"'Rec. Hos'!C47","v":"Aswini Dental Hospital, 143-A Block, Aditya\nEnclave, opp. Saradhi Studio, Ameerpet,\nHyderabad."}]
[47,"Senior Assistant",21,"19050-45850",7,"21820-48160",null,null,47,24300,null,46,{"$f":"'Rec. Hos'!C48","v":"Aswini Hospital, Near RTC Bus Stand\nMangalagiri Road, Guntur"}]
[48,"Senior Lecturer",22,"20680-46960",null,1,{"$f":"LOOKUP(F49,F50:G52,G50:G52)","v":"ZPPF"},null,48,24950,null,47,{"$f":"'Rec. Hos'!C49","v":"Aswini Netralayam, Guntur Road,\nNarsaraopeta, Guntur Dist."}]
[49,"Superintendent",23,"21820-48160",null,1,"ZPPF","ZPPF Loan",49,25600,null,48,{"$f":"'Rec. Hos'!C50","v":"Aswini Super Specialty Dental Hospital, 29-13-\n84, Opp. Badri Heritage Apartments,\nKaleswararao Road, suryaraopet, Vijayawada"}]
[41,{"$f":"LOOKUP(A51,A2:B50,B2:B50)","v":"School Assistant (Phy. Edn.)"},24,"23650-49360",null,2,"GPF","GPF Loan",50,26300,null,49,{"$f":"'Rec. Hos'!C51","v":"AVPR Super Specialtiy Dental Hl., 1-1-191,\nTahasil Chowrastha, Jagityal, Karimnagar\nDist."}]
[null,null,25,"25600-50560",null,3,"CPS","CPS Loan",51,27000,null,50,{"$f":"'Rec. Hos'!C52","v":"Aware Global Hospitals, 8-16-01, Sowbhagya\nNagar, Sagar Road, Lingoliguda,\nSaroornagar, Hyderabad."}]
[null,null,26,"27000-51760",null,1,{"$f":"LOOKUP(F53,F50:H52,H50:H52)","v":"ZPPF Loan"},null,52,27700,null,51,{"$f":"'Rec. Hos'!C53","v":"Axon Hospitals, 8-3-215. Srinivasanagar\nColony West, Opp. ICICI Bank, S.R.Nagar,\nHyderabad"}]
[null,null,27,"5470-12385",null,15,null,null,53,28450,null,52,{"$f":"'Rec. Hos'!C54","v":"Baba Dental Clinic, 2nd Floor, Mediworld, 14-\n37-39, Maharanipet, Visakhapatnam"}]
[3,{"$f":"LOOKUP(A55,A56:B66,B56:B66)","v":"self"},28,"5750-13030",null,{"$f":"LOOKUP(F54,C28:D60,D28:D60)","v":"12910-36700"},null,null,54,29200,null,53,{"$f":"'Rec. Hos'!C55","v":"Balaji Cancer Center, Gowri Shankar Theatre\nRoad, Kothapet, Guntur."}]
[1,"Father",29,"7200-16925",null,null,null,null,55,29950,null,54,{"$f":"'Rec. Hos'!C56","v":"Balaji Dental Hospital,11-231 , Opp:Girls Jr.\nCollege, Sai Nagar, Ananthapur."}]
[2,"Mother",30,"7385-17475",null,null,null,null,56,30750,null,55,{"$f":"'Rec. Hos'!C57","v":"Balaji Eye Care & Laser Centre, 1st Floor, 6-3-\n788/32, Durga Nagar Colony, Opp. Chandana\nBros. Ameerpet, Hyderabad"},null,1,{"$f":"LOOKUP(O57,O58:P61,P58:P61)","v":"S/o"}]
[3,"self",31,"9285-21550",null,null,null,null,57,31550,null,56,{"$f":"'Rec. Hos'!C58","v":"Balaji Hospital, Opp. Ram Laxman Theater,\nS.V.N. Road, Warangal"},null,1,"S/o"]
[4,"Legal Hier",32,"10285-24200",null,null,null,null,58,32350,null,57,{"$f":"'Rec. Hos'!C59","v":"Balaji Hospital, Plot No. 34,34/A, N.C.L.\nSouth, Pet Basheerabad, Medchal Road,\nSecunderabad."},null,2,"D/o"]
[5,"Husband",33,"14600-29250",null,1,"sir",null,59,33200,null,58,{"$f":"'Rec. Hos'!C60","v":"Balaji Multi Speciality Hospital, Near RTC Bus\nStand Circle, Madanapalli, Chittoor District."},null,3,"W/o"]
[6,"Wife",1,"Sri.",1,2,"Medam",null,60,34050,null,59,{"$f":"'Rec. Hos'!C61","v":"Balaji Orthopaedic & Trauma Hospital, 13-7-\n939/4, Tuda Office Road, Tirupathi"},null,4,"H/o"]
[7,"Son",2,"Smt.",{"$f":"LOOKUP(E61,F60:G62,G60:G62)","v":"sir"},3,"Medam",null,61,34900,null,60,{"$f":"'Rec. Hos'!C62","v":"Bharat Dental Care Multi Speciality Dental\nHospital, Theatre Road, Tuni, E.G.Dist."}]
[8,"Daughter",3,"Kum.",null,null,null,null,62,35800,null,61,{"$f":"'Rec. Hos'!C63","v":"Bharathi Hospitals, Gandhi Nagar, R.S. Road,\nY.M. Palli, Kadapa."}]
[9,"Widower",1,{"$f":"LOOKUP(C64,C61:D63,D61:D63)","v":"Sri."},null,null,null,null,63,36700,null,62,{"$f":"'Rec. Hos'!C64","v":"Bhavya Multi Speciality Hospital, Plot NO.65,\nRoad No.5, New Samathapuri Colony, Nagole\nX Roads, Hyderabad"}]
[10,"Nephew",1,"Baby.",6,{"$f":"LOOKUP(E65,C65:D71,D65:D71)","v":"Smt."},null,null,64,37600,null,63,{"$f":"'Rec. Hos'!C65","v":"Bhimavaram Hospital, J.P. Road,\nBhimavaram."}]
[11,"Niece",2,"Kum.",null,null,null,null,65,38570,null,64,{"$f":"'Rec. Hos'!C66","v":"Bhuma Super Speciality Dental Hospital,\n21/604, Opp. Masjid, 7 Roads Circle, Kadapa"}]
[null,null,3,"Master.",null,null,null,null,66,39540,null,65,{"$f":"'Rec. Hos'!C67","v":"Bollineni Eye Hospital and Research Center,\nDargametta, Nellore."}]
["DDO Desgn",null,4,"Miss.",null,null,null,null,67,40510,null,66,{"$f":"'Rec. Hos'!C68","v":"Bollineni Heart Centre Pvt. Ltd. 77-9-37/1,\nSeelam Nookaraju Complex Street,\nRajhmundry, E.G.Dist."}]
[1,"Assistant Director",5,"Mrs.",null,null,null,null,68,41550,null,67,{"$f":"'Rec. Hos'!C69","v":"Bollineni Heart Centre, 46-7-47, Danavaipet,\nRajhmundry."}]
[2,"Deputy Director",6,"Smt.",null,null,null,null,75,49360,null,68,{"$f":"'Rec. Hos'!C70","v":"Bollineni Ramanaiah Memorial Hospital Pvt.\nLtd., (Dental Department) Ambuja Centre,\nDurgamitta, Nellore."}]
[3,"Deputy Educational Officer",7,"Sri.",null,null,null,null,76,50560,null,69,{"$f":"'Rec. Hos'!C71","v":"Bollineni Ramanaiah Memorial Hospital,\nAmbuja Centre, Durgamitta, Nellore."}]
[4,"Deputy Inspector of Schools",null,null,null,null,null,null,77,51760,null,70,{"$f":"'Rec. Hos'!C72","v":"Bombay Nursing Home, Hyderabad Road,\nNizamabad."}]
[5,"Gazetted H.M. Gr-I ",1,{"$f":"LOOKUP(C73,C74:D75,D74:D75)","v":"Government"},null,null,null,null,78,53060,null,71,{"$f":"'Rec. Hos'!C73","v":"C.C. Shoroff Memorial Hospital, Barkatpura,\nHyderabad"}]
[6,"Gazetted H.M. Gr-II ",1,"Government",null,null,null,null,79,54360,null,72,{"$f":"'Rec. Hos'!C74","v":"C.N. Hospitals, Birla Compound, B-Camp,\nkurnool."}]
[7,"Head Master",2,"Private",null,null,null,null,80,55660,null,73,{"$f":"'Rec. Hos'!C75","v":"C.S. Reddy Super, Speciality Dental Hospital,\n3/271 Dr. Prabhakar Rao, Hospital Complex,\nChristial Lane , Kadapa."}]
[8,"Head Mistress",null,null,null,null,null,null,81,5470,null,74,{"$f":"'Rec. Hos'!C76","v":"Care Dental Specialities Hospital, 40/353-C,\nGandhi Nagar, Kurnool"}]
[9,"Mandal Educational Officer",null,null,null,null,null,null,82,5605,null,75,{"$f":"'Rec. Hos'!C77","v":"Care Hospital (A unit of Quality care India Ltd),\nBanjara Hills, Hyderabad."}]
[10,"Principal",null,null,null,null,null,null,83,5750,null,76,{"$f":"'Rec. Hos'!C78","v":"Care Hospital (Quality Care Inida Limited)\nExhibition Road, Nampally, Hyderabad."}]
[11,"Project Officer",null,null,null,null,null,null,84,5895,null,77,{"$f":"'Rec. Hos'!C79","v":"Care Hospital, Waltair Main Road,\nVisakhapatnam"}]
[12,"R.J.D.S.E.",null,null,null,null,null,null,85,6040,null,78,{"$f":"'Rec. Hos'!C80","v":"Care Super Specialty Dental Hospital Pvt. Ltd,\nJuvvalapalem Road, Bhimavaram."}]
[null,null,null,null,null,null,null,null,86,6195,null,79,{"$f":"'Rec. Hos'!C81","v":"Care Super Specialty Hospital, 16-11/72,\nPogathota, Nellore."}]
[null,null,null,null,1,"Father","he",{"$f":"VLOOKUP(A55,E82:G92,3,FALSE)","v":"he"},87,6350,null,80,{"$f":"'Rec. Hos'!C82","v":"Chaitanya Dental Hospital, 1-1-230/33 Jyothi\nBhavan, Chikkadpally, Hyderabad."}]
[null,null,null,null,2,"Mother","she",null,88,6505,null,81,{"$f":"'Rec. Hos'!C83","v":"Chaitanya Eye Hospital, Tikkili Road, Near\nSiddhartha Arts College, Mogalrajpuram,\nVijayawada."}]
[null,null,null,null,3,"self","he",null,89,6675,null,82,{"$f":"'Rec. Hos'!C84","v":"Chaitanya Hospital, Near By-Pass, Anjaiah\nRoad, Ongole, Prakasam Dist."}]
[null,null,null,null,4,"Legal Hier","she",null,90,6845,null,83,{"$f":"'Rec. Hos'!C85","v":"Challa Eye Care Centre, Plot No. 8-2-268/R/9-\nP, Sagar Society Main Road, Road No.2,\nBanjara Hills, Hyderabad"}]
[null,"Assistant Director",2,null,5,"Husband","he",null,91,7015,null,84,{"$f":"'Rec. Hos'!C86","v":"Challa Hospital, 7-1-71/A/1, Dharam Karan\nRoad, Ameerpet, Hyderabad."}]
[null,"Deputy Director",2,null,6,"Wife","she",null,92,7200,null,85,{"$f":"'Rec. Hos'!C87","v":"Chandamama Children's Hospital, Sundaraiah\nBhavan Road, Ongole, Prakasam Dist."}]
[null,"Deputy Educational Officer",1,null,7,"Son","he",null,93,7385,null,86,{"$f":"'Rec. Hos'!C88","v":"Charitasri Hospitals Ltd., 29-6-8/1,\nRamachandra Rao Road, Suryaraopet,\nVijayawada - 520002."}]
[null,"Deputy Inspector of Schools",1,null,8,"Daughter","she",null,94,7570,null,87,{"$f":"'Rec. Hos'!C89","v":"Chelmada Ananda Rao Institute of Medical\nSciences, Karimnagar"}]
[null,"Gazetted H.M. Gr-I ",2,null,9,"Widower","she",null,95,7770,null,88,{"$f":"'Rec. Hos'!C90","v":"Citi Orthopaedic Centre, H.No. 32-6-18A,\nSikha Mani Centre, Prajasaktinagar,\nVijayawada"}]
[null,"Gazetted H.M. Gr-II ",2,null,10,"Nephew","he",null,96,7970,null,89,{"$f":"'Rec. Hos'!C91","v":"City Cancer Center, 33-25-33, Ch. Venkata\nKrishnaiah Street, Suryaraopet, Vijayawada."}]
[null,"Head Master",2,null,11,"Niece","she",null,97,8170,null,90,{"$f":"'Rec. Hos'!C92","v":"City Super Speciality Dental Hospital, Shobha\nPavani Complex, 1 st Floor, Vidya Nagar,\nHyderabad."}]
[null,"Head Mistress",2,null,null,null,null,null,98,8385,null,91,{"$f":"'Rec. Hos'!C93","v":"Clear Vision Eye Hospital, 3-6-272, Opp.\nTelugu Academy, Himayatnagar, Hyd."}]
[null,"Mandal Educational Officer",1,null,null,null,null,null,99,8600,null,92,{"$f":"'Rec. Hos'!C94","v":"Curie City Cancer Hospital, Padavalarevu,\nGunadala, Vijayawada"}]
[null,"Principal",2,null,null,null,null,null,100,8815,null,93,{"$f":"'Rec. Hos'!C95","v":"D.B.R. & S.K. Super Specilaity Hospital, 18-1-\n505, Mask Road, Opp: V.V.Mahal, Tirupathi"}]
[null,"Project Officer",1,null,null,null,null,null,101,9050,null,94,{"$f":"'Rec. Hos'!C96","v":"D.B.R. Dental Hospital, H. No. 6-2-122/1,\nBehind Z.P. Khammam."}]
[null,"R.J.D.S.E.",1,null,1,"Father","his",{"$f":"VLOOKUP(A55,E97:G107,3,FALSE)","v":"his"},102,9285,null,95,{"$f":"'Rec. Hos'!C97","v":"D.V.Raju Eye Hospital, P.R.College Road,\nKakinada, East Godavary Dist."}]
[null,null,null,null,2,"Mother","her",null,103,9520,null,96,{"$f":"'Rec. Hos'!C98","v":"Dental Venue Multi Speciality Hospital, F-14,\nFirst Floor, Deepthi Apartments, S.P. Road,\nSecunderabad."}]
[null,null,null,null,3,"self","his",null,104,9775,null,97,{"$f":"'Rec. Hos'!C99","v":"Dentnova Denal Hospital, 1st floor, Taj\nComplex, Nampally, Hyderabad."}]
[null,null,null,null,4,"Legal Hier","her",null,105,10030,null,98,{"$f":"'Rec. Hos'!C100","v":"Dentocare Super speciailty Dental Hospital,\n12-2-962, Opp: Baby Hospital, 2nd cross, Sai\nNagar, Ananthapur."}]
[1,"Adilabad District","Adilabad",null,5,"Husband","his",null,106,10285,null,99,{"$f":"'Rec. Hos'!C101","v":"Denty's (A unit of Today's Health Care India\nPvt. Ltd.) 60-1-7/1, Siddhartha Nagar,\nVijayawada"}]
[2,"Ananthapur District","Ananthapur",null,6,"Wife","her",null,107,10565,null,100,{"$f":"'Rec. Hos'!C102","v":"Devishetty Super Speciality Hospital, Civil\nHospital Road, Karimnagar"}]
[3,"APSR Nellore District","Nellore",null,7,"Son","his",null,108,10845,null,101,{"$f":"'Rec. Hos'!C103","v":"Diacon Diabetes Specialty Centre &\nDiagnostics, VV's Vintage Boulavard, 1st\nFloor, H.No. 6-3-1093, Rajbhavan Road,\nSomajiguda, Hyderabad."}]
[4,"Chittoor District","Chittoor",null,8,"Daughter","her",null,109,11125,null,102,{"$f":"'Rec. Hos'!C104","v":"Dilsuknagar Super Speciality Dental Hospital,\nSirigiri Complex, Dilsulknagar, Hyderabad."}]
[5,"East Godavari District","Kakinada",null,9,"Widower","her",null,110,11440,null,103,{"$f":"'Rec. Hos'!C105","v":"DNR Advanced Dental Hospital, 16-2-149,\nPogathota, Nellore"}]
[6,"Guntur District","Guntur",null,10,"Nephew","his",null,111,11755,null,104,{"$f":"'Rec. Hos'!C106","v":"Dr. Akbar Eye Hospital and Laser Center, 12-\n3-234, 6th Lane, Srinagar, Ananthapur"}]
[7,"Hyderabad District","Hyderabad",null,11,"Niece","her",null,112,12070,null,105,{"$f":"'Rec. Hos'!C107","v":"Dr. Anji Reddy Multi Specialty Hospital Pvt.\nLtd., 16-687, Main Road, Piduguralla, Guntur."}]
[8,"Kareemnagar District","Kareem Nagar",null,null,null,null,null,113,12385,null,106,{"$f":"'Rec. Hos'!C108","v":"Dr. Gowds Dental Hospitals, #19, Durga\nEnclave, Road No.12, Banjara Hills,\nHyderabad"}]
[9,"Khammam District","Khammam",null,null,null,null,null,114,12700,null,107,{"$f":"'Rec. Hos'!C109","v":"Dr. J.S.R. Dental Health Speciality, 1-128,\nSurya Towers, Bhavani Nagar, Malkajgiri,\nHyderabad."}]
[10,"Krishna District","Machilipatnam",null,null,null,null,null,115,13030,null,108,{"$f":"'Rec. Hos'!C110","v":"Dr. Konda Reddy Dental Hospital, 16/749,\nShankara Agraharam, Nellore."}]
[11,"Kurnool District","Kurnool",null,null,null,null,null,116,13390,null,109,{"$f":"'Rec. Hos'!C111","v":"Dr. Kotareddy Hospital, Main Road, Kandukur,\nPrakasam Dist."}]
[12,"Mahboobnagar District","Mahboobnagar",null,null,null,null,null,117,13750,null,110,{"$f":"'Rec. Hos'!C112","v":"Dr. Lakshman's Institute of Orthopedics,\nC.V.R.N. Road, Karimnagar."}]
[13,"Medak District","Sanga Reddy",null,null,null,null,null,118,14175,null,111,{"$f":"'Rec. Hos'!C113","v":"Dr. Malik Speciality Dental Cosmotic &\nSurgery Centre, R.P.Road, Secunderabad"}]
[14,"Nalgonda District","Nalgonda",null,null,null,null,null,119,14600,null,112,{"$f":"'Rec. Hos'!C114","v":"Dr. PJR Super Speciality Dental Hospital, 8-3-\n318/6B/7, Engineers Colony, Yousufguda\nMain Road, Hyderabad"}]
[15,"Nizamabad District","Nizamabad",null,null,null,null,null,120,15025,null,113,{"$f":"'Rec. Hos'!C115","v":"Dr. Prasad's Multi Specialty Dental Hospital,\nBanjara Hills, Hyderabad."}]
[16,"Prakasham District","Ongole",null,null,null,null,null,121,15500,null,114,{"$f":"'Rec. Hos'!C116","v":"Dr. Ramayya's Urology, Nephrology Institute &\nHospital Pvt. Ltd. Adg. New MLA Quarters,\nBasheerbagh, Hyderabad."}]
[17,"Ranga Reddy District","Hyderabad",null,null,null,null,null,122,15975,null,115,{"$f":"'Rec. Hos'!C117","v":"Dr. Sridhar International Dental Hospital &\nResearch Center, Eluru Road, Vijayawada."}]
[18,"Sreekakulam District","Sreekakulam",null,null,null,null,null,123,16450,null,116,{"$f":"'Rec. Hos'!C118","v":"Dr. Vivekananda Reddy's Dental Hospital\nMulti Specialty and Inplant Center,\nDilsukhnagar, Hyderabad."}]
[19,"Vishakapatnam District","Vishakapatnam",null,null,null,null,null,124,16925,null,117,{"$f":"'Rec. Hos'!C119","v":"Dr.Bhoom Reddy's Hospital, Civil Hospital\nRaod, Karimnagar."}]
[20,"Vizianagaram District","Vizianagaram",null,null,null,null,null,125,17475,null,118,{"$f":"'Rec. Hos'!C120","v":"Dr.Ramesh Cardiac & Multi Speciality Hospital\nLtd., (City Cardiac Research Center Ltd) Ring\nRoad, Near ITI College, Vijyawada - 520008."}]
[21,"Warangal District","Warangal",null,null,null,null,null,126,18025,null,119,{"$f":"'Rec. Hos'!C121","v":"Dr.Sreeedhar's Kidney & Multi Speciality\nHospital, 13-6-437/I/L/I, Near Al-Quaba\nMasjid, Khadesrbagh, Nanal Nagar 'X' Road,\nMehidipatnam, Hyderabad"}]
[22,"West Godavari District","Elure",null,null,null,null,null,127,18575,null,120,{"$f":"'Rec. Hos'!C122","v":"Drishti Eye Care, Flat No.114-A, Lane Opp:\nSBI, Srinagar Colony Main Road, Hyderabad."}]
[23,"YSR Kadapa District","Kadapa",null,null,null,null,null,128,19125,null,121,{"$f":"'Rec. Hos'!C123","v":"Durga Nursing Home, 20-6-138(2), Anjaiah\nRoad, Ongole, Prakasam Dist."}]
[null,96,{"$f":"B124","v":96},null,null,null,null,null,129,19675,null,122,{"$f":"'Rec. Hos'!C124","v":"Durga Nursing Home, 20-6-138(2), Anjaiah\nRoad, Ongole, Prakasam Dist."}]
[null,1,null,null,null,null,null,null,130,20300,null,123,{"$f":"'Rec. Hos'!C125","v":"Durgabai Deshmukh Hospital & Research\nCentre, University Road, Vidyanagar,\nHyderabad"}]
[null,2,null,null,null,null,null,null,131,20925,null,124,{"$f":"'Rec. Hos'!C126","v":"E.N.T. Nursing Home, Bhagathsingh Statu\nCenter, Kothapet, Guntur"}]
[null,3,null,null,null,null,null,null,132,21550,null,125,{"$f":"'Rec. Hos'!C127","v":"Eshwar Super Speciality Dental Hospital, 50-\n726-6 B, Kurnool"}]
[null,4,null,null,null,null,null,null,133,22175,null,126,{"$f":"'Rec. Hos'!C128","v":"FMS Dental Hospital, Aiyangar Plaza, Bank\nStreet, Koti, Hyderbad"}]
[null,5,null,null,null,null,null,null,134,22800,null,127,{"$f":"'Rec. Hos'!C129","v":"Frontier Lifeline Pvt. Ltd., R-30-C, Ambattur\nIndustrial 17514Estate Road, Mogappair,\nChennai"}]
[null,6,null,null,null,null,null,null,135,23500,null,128,{"$f":"'Rec. Hos'!C130","v":"G.K.Multi Speciality Hospital, 6-1-1,\nChintkuntwada, Nirmal, Adilabad District."}]
[null,7,null,null,null,null,null,null,136,24200,null,129,{"$f":"'Rec. Hos'!C131","v":"G.R.Hospital, 4-8-114, Opp. Hanamkonda\nPolice Station, Kumarpalli, Hanamkonda,\nWarangal"}]
[null,8,null,null,null,null,null,null,137,24900,null,130,{"$f":"'Rec. Hos'!C132","v":"Gadam Multi Speciality Dental Hospital &\nImplant Centre, 1st floor, Redman Plaza, 2nd\nLine Dwarakanagar, Visakhapatnam"}]
[null,9,null,null,null,null,null,null,138,25600,null,131,{"$f":"'Rec. Hos'!C133","v":"Geetha Mullapudi International Hi-technology\nDental Hospital, 1st floor, Sri Challa Apparao\nMunicipal Complex, Near Kotipalli Bus Stand,\nRajahmundry, E..G.Dist."}]
[null,10,null,null,null,null,null,null,139,26300,null,132,{"$f":"'Rec. Hos'!C134","v":"Geetha Mutli Speciality Hospital,\nSeceunderabad."}]
[null,11,null,null,null,null,null,null,140,27000,null,133,{"$f":"'Rec. Hos'!C135","v":"Giridhar ENT Hospital & Laser Centre Ch.\nDurgaiah Street, Suryaraopet, Vijayawada"}]
[null,12,null,null,null,null,null,null,31,{"$f":"LOOKUP(I136,I2:J135,J2:J135)","v":15700},null,134,{"$f":"'Rec. Hos'!C136","v":"Global Dental Hospital, Vajra Residency,\nGround Floor, Musheerabad, Hyderabad."}]
[null,13,null,null,null,null,null,null,null,null,null,135,{"$f":"'Rec. Hos'!C137","v":"Global Hospitals, 6-1-1070/1 to 4, Lakadi-Ka-\nPool, Hyderabad"}]
[null,14,null,null,null,null,null,null,null,null,null,136,{"$f":"'Rec. Hos'!C138","v":"Global Hospitals, Banjara Hills, Hyderabad"}]
[null,15,null,null,null,null,null,null,null,null,null,137,{"$f":"'Rec. Hos'!C139","v":"Global Multi Speciality Hospital, 27-39-1, MG\nRoad, Vijayawada - 520 002"}]
[null,16,null,null,null,null,null,null,null,null,null,138,{"$f":"'Rec. Hos'!C140","v":"Goodwill Kidney and Surgical Center, Opp.\nKhaja Mansion, Masabtank Road, Hyd."}]
[null,17,null,null,null,null,null,null,null,null,null,139,{"$f":"'Rec. Hos'!C141","v":"Gowri Gopal Hospitals Pvt. Ltd., Kurnool"}]
[null,18,null,null,null,null,null,null,null,null,null,140,{"$f":"'Rec. Hos'!C142","v":"Gowtami Eye Institute, 1, R.V.Nagar,\nKorukonda Road, Opp. Market Yard,\nRajahmundry, E.G.Dt."}]
[null,19,null,null,null,null,null,null,null,null,null,141,{"$f":"'Rec. Hos'!C143","v":"GSL General Hospital, NH-5, Lakshmi Puram,\nRajhmundry."}]
[null,20,null,null,null,null,null,null,null,null,null,142,{"$f":"'Rec. Hos'!C144","v":"Guardian Multi Speciality Hospital, 15-1-237,\nOpp. L.B.College, Mulugu 'X' Road, Warangal"}]
[null,21,null,null,null,null,null,null,null,null,null,143,{"$f":"'Rec. Hos'!C145","v":"Guntur Dental SpecialtyHospital, Beside\nPallavi Complex, Station Road, Guntur"}]
[null,22,null,null,null,null,null,null,null,null,null,144,{"$f":"'Rec. Hos'!C146","v":"Gurunanak Care Hospital, 1-4-908/7/1,\nMusheerabad Main Road, Musheerabad,\nHyderabad"}]
[null,23,null,null,null,null,null,null,null,null,null,145,{"$f":"'Rec. Hos'!C147","v":"GVR Childrens Hospital, 43/48, 2nd Lane,\nN.R.Pet, Kurnool - 518004."}]
[null,24,null,null,null,null,null,null,null,null,null,146,{"$f":"'Rec. Hos'!C148","v":"Harini Gastro & Liver Centre, 29-14-51,\nPrakasam Road, Suryaraopet, Vijayawada."}]
[null,25,null,null,null,null,null,null,null,null,null,147,{"$f":"'Rec. Hos'!C149","v":"Haripriya Dantha Vaidyasala, 18-1-503, V.V.\nMahal Road, Opp. Incometax Office, Tirupathi"}]
[null,26,null,null,null,null,null,null,null,null,null,148,{"$f":"'Rec. Hos'!C150","v":"Harsha Sai Eye Hospital, Dwarakanagar,\nNizamabad."}]
[null,27,null,null,null,null,null,null,null,null,null,149,{"$f":"'Rec. Hos'!C151","v":"Health Hospitals Prakasam Road, Tenali -\n522201,Guntur District."}]
[null,28,null,null,null,null,null,null,null,null,null,150,{"$f":"'Rec. Hos'!C152","v":"Heart Care Centre, Dornakal Raod, Near\nAndhra Bank, Suryaraopet, Vijayawada."}]
[null,29,null,null,null,null,null,null,null,null,null,151,{"$f":"'Rec. Hos'!C153","v":"Help Hospital, MG Road, Vijayawada"}]
[null,30,null,null,null,null,null,null,null,null,null,152,{"$f":"'Rec. Hos'!C154","v":"Heritage Hospital, 6-3-907/2, Somajiguda,\nHyderabad"}]
[null,31,null,null,null,null,null,null,null,null,null,153,{"$f":"'Rec. Hos'!C155","v":"Himabindu Multi Specialty Hospital, Vinay\nNagar, Sagar Road, Santhoshnagar, Hyd."}]
[null,32,null,null,null,null,null,null,null,null,null,154,{"$f":"'Rec. Hos'!C156","v":"Hope Childrens Hospital, 5-9-24/81, Lake Hills\nRoad, Basheerbagh, Hyderabad - 500463."}]
[null,33,null,null,null,null,null,null,null,null,null,155,{"$f":"'Rec. Hos'!C157","v":"Hope Super SpecialtyHospital, Balaji Nagar,\nKhammam"}]
[null,34,null,null,null,null,null,null,null,null,null,156,{"$f":"'Rec. Hos'!C158","v":"Hyderabad Kidney & Laproscopic Centre,\nJudges Colony,Malakpet, Hyderabad."}]
[null,35,null,null,null,null,null,null,null,null,null,157,{"$f":"'Rec. Hos'!C159","v":"Hyderabad Nusing Home Pvt. Ltd.,\nBasheerbagh, Hyderabad."}]
[null,36,null,null,null,null,null,null,null,null,null,158,{"$f":"'Rec. Hos'!C160","v":"Identity Multi Specialty Dental Hospital and\nResearch Center, 21/139, R.S. Road, Kadapa."}]
[null,37,null,null,null,null,null,null,null,null,null,159,{"$f":"'Rec. Hos'!C161","v":"Image Hospital, 8-3-903/F/12 & 13, Image\nHouse, Ameerpet, Hyderabad"}]
[null,38,null,null,null,null,null,null,null,null,null,160,{"$f":"'Rec. Hos'!C162","v":"Image Hospitals, 1-90/2/G/2, Arunodaya Co-\noperative Housing Society, Madhapur,\nHyderabad"}]
[null,39,null,null,null,null,null,null,null,null,null,161,{"$f":"'Rec. Hos'!C163","v":"Indian Red Cross Society, Red Cross Road,\nNear Vegitable Market, Nellore."}]
[null,40,null,null,null,null,null,null,null,null,null,162,{"$f":"'Rec. Hos'!C164","v":"Indira Multi Speciality Dental Hospital, 16-2-\n307, Near Sunday Market, Subrahmanya\nSwamy Temple Street, Pogathota, Nellore"}]
[null,41,null,null,null,null,null,null,null,null,null,163,{"$f":"'Rec. Hos'!C165","v":"Indo- American Cancer Institute & Research\nCentre, Banjara Hills, Hyderabad"}]
[null,42,null,null,null,null,null,null,null,null,null,164,{"$f":"'Rec. Hos'!C166","v":"Indur Cancer Hospital, Krishnapuri Colony,\nMadhavanagar, Nizamabad"}]
[null,43,null,null,null,null,null,null,null,null,null,165,{"$f":"'Rec. Hos'!C167","v":"Indus Hospitals, 18-1-6, K.G.H. Down Road,\nMaharanipet, Visakhapatnam"}]
[null,44,null,null,null,null,null,null,null,null,null,166,{"$f":"'Rec. Hos'!C168","v":"Innova Children's Heart Hospital Pvt., Ltd., 12-\n5-30, White House, Tarnaka, Moulali Road,\nSecunderabad"}]
[null,45,null,null,null,null,null,null,null,null,null,167,{"$f":"'Rec. Hos'!C169","v":"J.J.Dental Clinic, Temple Street, Kakinada,\nE.G.Dist."}]
[null,46,null,null,null,null,null,null,null,null,null,168,{"$f":"'Rec. Hos'!C170","v":"J.J.Hospital, Plot No. 57, Kalyan Nagar, 1st\nPhase, Behind T.B.Hospital, Hyderabad"}]
[null,47,null,null,null,null,null,null,null,null,null,169,{"$f":"'Rec. Hos'!C171","v":"Jabilli Mother & Child Hospital, Beside\nChurch, Wyra Road, Khammam."}]
[null,48,null,null,null,null,null,null,null,null,null,170,{"$f":"'Rec. Hos'!C172","v":"Jaya Hospitals, Chowrastha, Hanamkonda,\nWarangal"}]
[null,49,null,null,null,null,null,null,null,null,null,171,{"$f":"'Rec. Hos'!C173","v":"Jayabharath Hospital, 16/2884,\nSomasekharapuram, Nellore"}]
[null,50,null,null,null,null,null,null,null,null,null,172,{"$f":"'Rec. Hos'!C174","v":"Jayalakshmi Hospitals, 9-5-15, J.P.N. Road,\nWarangal"}]
[null,51,null,null,null,null,null,null,null,null,null,173,{"$f":"'Rec. Hos'!C175","v":"Jayam Super Specialty Dental Hospital, Shop\nNo. 15 and 16, Municipal Shopping Complex,\nAnanthapur"}]
[null,52,null,null,null,null,null,null,null,null,null,174,{"$f":"'Rec. Hos'!C176","v":"Jeevana Jyothi Hospitals, D.No. 15/381,\nKamalanagar, Anantapur"}]
[null,53,null,null,null,null,null,null,null,null,null,175,{"$f":"'Rec. Hos'!C177","v":"Jnanananda Ophthalmic Institute,\nBhimavaram, W.G. Dist."}]
[null,54,null,null,null,null,null,null,null,null,null,176,{"$f":"'Rec. Hos'!C178","v":"Jyothi Hospitals, 19/1350, Beside Anjaneya\nSwamy Temple, Church Road, Miryalaguda,\nNalgonda."}]
[null,55,null,null,null,null,null,null,null,null,null,177,{"$f":"'Rec. Hos'!C179","v":"K.M. Dental Hosptials, Global Nagar, Munbai\nRoad, Buchireddy Palem, Nellore"}]
[null,56,null,null,null,null,null,null,null,null,null,178,{"$f":"'Rec. Hos'!C180","v":"Kadapa Super Speciality Dental Hospital\n4/468, Behind Ramalayam, Kadapa"}]
[null,57,null,null,null,null,null,null,null,null,null,179,{"$f":"'Rec. Hos'!C181","v":"Kakathiya Super Specialty Dental Hospital,\nHanumakonda, Warangal."}]
[null,58,null,null,null,null,null,null,null,null,null,180,{"$f":"'Rec. Hos'!C182","v":"Kalyani Dental Hospital Dentistry & Implant\nCentre, Opp. Green Park Hotel, Begumpet,\nHyderabad."}]
[null,59,null,null,null,null,null,null,null,null,null,181,{"$f":"'Rec. Hos'!C183","v":"Kalyani Hospital, 6-1-69, Stadium Road,\nHanumakonda, Warangal."}]
[null,60,null,null,null,null,null,null,null,null,null,182,{"$f":"'Rec. Hos'!C184","v":"Kamal Vilekar's Multi Speciality Dental\nHospital, D.No. 6-2-15, Chinna Bazar,\nSrikakulam"}]
[null,61,null,null,null,null,null,null,null,null,null,183,{"$f":"'Rec. Hos'!C185","v":"Kamala Hospital, Kamala Complex, Chandna\nBrother's Center, Dilsuknagar, Hyderabad."}]
[null,62,null,null,null,null,null,null,null,null,null,184,{"$f":"'Rec. Hos'!C186","v":"Kamineni Hospitals ( Previously called\nWockhadt Hospitals which is taken over by\nthe Management of kamineni Hospitas) 4-1-\n1227, King Koti Road, Abids, Hyderabad –\n500001."}]
[null,63,null,null,null,null,null,null,null,null,null,185,{"$f":"'Rec. Hos'!C187","v":"Kamineni Hospitals, Basheer Bagh,\nHyderabad."}]
[null,64,null,null,null,null,null,null,null,null,null,186,{"$f":"'Rec. Hos'!C188","v":"Kamineni Hospitals, L.B.Nagar, Hyderabad"}]
[null,65,null,null,null,null,null,null,null,null,null,187,{"$f":"'Rec. Hos'!C189","v":"Kamineni Institute of Medical Sciences and\nHospital, Sripuram, Narketpally, Nalgonda."}]
[null,66,null,null,null,null,null,null,null,null,null,188,{"$f":"'Rec. Hos'!C190","v":"Kandukuri Hospitals, Vishnava Street, Kavali,\nNellore, Dist."}]
[null,67,null,null,null,null,null,null,null,null,null,189,{"$f":"'Rec. Hos'!C191","v":"Karumuri Super Speciality Hospitals, 3-4-73,\nOld Club Road, Guntur - 522001."}]
[null,68,null,null,null,null,null,null,null,null,null,190,{"$f":"'Rec. Hos'!C192","v":"Kinnera Super Speciality Hospital, Wyra\nRoad, Khammam"}]
[null,69,null,null,null,null,null,null,null,null,null,191,{"$f":"'Rec. Hos'!C193","v":"KNM Smile Dental Hospital, 104, Sai Towers,\nBeside Kalaniketan, Main Road, Dilshuk\nNagar, Hyderabad.The hospital was shifted to\nG-5, Kochar Apartments, Opp. Pantaloons &\nSony Centre, Shamlal Buildings, Begumpet,\nHyderabad"}]
[null,70,null,null,null,null,null,null,null,null,null,192,{"$f":"'Rec. Hos'!C194","v":"Kommineni Super Speciality Dental Hospital,\n490A, 1st Floor, Reddy & Reddy Colony,\nTirupathi"}]
[null,71,null,null,null,null,null,null,null,null,null,193,{"$f":"'Rec. Hos'!C195","v":"Konark Hospitals, Plot No.13 and 14, Beside\nSharwood Public School, Patbasheerbad\nVillage, Qutubullapur Mandal, Kompally,\nR.R.Dist."}]
[null,72,null,null,null,null,null,null,null,null,null,194,{"$f":"'Rec. Hos'!C196","v":"Konaseema Institute of Medical Sciences, NH -\n214, Chaitanya Nagar, Amalapuram - 533\n201, East Godavari."}]
[null,73,null,null,null,null,null,null,null,null,null,195,{"$f":"'Rec. Hos'!C197","v":"Krishna Children's Hospital, (A unit of Ashwik\nHospital Pvt Ltd), 11-5-423/A&B, Niloufer\nHospital Road, Opp-Hanuman Temple,\nLakdikapool, Hyderabad - 500006."}]
[null,74,null,null,null,null,null,null,null,null,null,196,{"$f":"'Rec. Hos'!C198","v":"Krishna Denta Cure Advanced Super\nSpecialty Dental Hospital, 29-33-9/10, Alluri\nSitharamaraju Junction, Rajahmundry"}]
[null,75,null,null,null,null,null,null,null,null,null,197,{"$f":"'Rec. Hos'!C199","v":"Krishna Institute of Medical Sceinces, Minister\nRoad, Begumpet, Hyderabad."}]
[null,76,null,null,null,null,null,null,null,null,null,198,{"$f":"'Rec. Hos'!C200","v":"Kurnool Heart & Brain Centre, 43-1-1-K-B-4,\nSapthagiri Nagar, A-Camp Extension, Near\nNew Ayyappa swamy Temple, Kurnool."}]
[null,77,null,null,null,null,null,null,null,null,null,199,{"$f":"'Rec. Hos'!C201","v":"L.K. Hospitals Pvt. Ltd., 4-159 & 4-172,\nMaruthi Nagar, Malkajgiri, Ranga Reddy Dist."}]
[null,78,null,null,null,null,null,null,null,null,null,200,{"$f":"'Rec. Hos'!C202","v":"Lakkireddy 'Dental' Super Speciality Hospital,\n43/39-A, 2nd Line, N.R.Peta, Kurnool"}]
[null,79,null,null,null,null,null,null,null,null,null,201,{"$f":"'Rec. Hos'!C203","v":"Lalitha Eye Hospital, 15/246, Thikkana\nTelephone Bhavan Exchange Street,\nBrindavanam, Nellore"}]
[null,80,null,null,null,null,null,null,null,null,null,202,{"$f":"'Rec. Hos'!C204","v":"Lalitha Superspeciality Hospital Heart & Brain\nCentre, Gowrisankar Theatre Road, Kothapet,\nGuntur."}]
[null,81,null,null,null,null,null,null,null,null,null,203,{"$f":"'Rec. Hos'!C205","v":"Latha Super Specialities, 29-14-58, Prakasam\nRoad, Suryaraopet, Vijayawada"}]
[null,82,null,null,null,null,null,null,null,null,null,204,{"$f":"'Rec. Hos'!C206","v":"Laxmi Narasimha Hospital, Nayeem Nagar,\nHanamkonda, Warangal."}]
[null,83,null,null,null,null,null,null,null,null,null,205,{"$f":"'Rec. Hos'!C207","v":"Lazarus Hospital, Waltair main road,\nVisakhapatnam"}]
[null,84,null,null,null,null,null,null,null,null,null,206,{"$f":"'Rec. Hos'!C208","v":"Life Hospitals 2-2-12/3/C, Durgabai\nDeshmukh Centre, Shivam Road, D.D.\nColony, Hyderabad - 500 007"}]
[null,85,null,null,null,null,null,null,null,null,null,207,{"$f":"'Rec. Hos'!C209","v":"Life Kare Dental Hospital, 9-7-83/1, Sri Laxmi\nComplex, Maruthi Nagar, Santhosh Nagar,\nHyderabad - 500059."}]
[null,86,null,null,null,null,null,null,null,null,null,208,{"$f":"'Rec. Hos'!C210","v":"Life Line Hospitals, 2-4-152, Ram Nagar,\nHanmakonda, Warangal District."}]
[null,87,null,null,null,null,null,null,null,null,null,209,{"$f":"'Rec. Hos'!C211","v":"Lions District 324-C1, Cancer Treatment &\nResearch Centre, Seethammadhara (NE),\nVisakhapatnam - 530013."}]
[null,88,null,null,null,null,null,null,null,null,null,210,{"$f":"'Rec. Hos'!C212","v":"Lotus Children's Hospital, Lakdika Pool,\nHyderabad."}]
[null,89,null,null,null,null,null,null,null,null,null,211,{"$f":"'Rec. Hos'!C213","v":"LV Prasad Eye Institute, Kallam Anji Reddy\nCampus, LV Prasad Marg, Banjara Hills,\nHyderabad"}]
[null,90,null,null,null,null,null,null,null,null,null,212,{"$f":"'Rec. Hos'!C214","v":"M.N.Hospitals, 4/10, Brodipet, Guntur"}]
[null,91,null,null,null,null,null,null,null,null,null,213,{"$f":"'Rec. Hos'!C215","v":"M.S. Multi Speciality Dental Hospital, 8-2-\n165/8, Wyra Road, Khammam"}]
[null,92,null,null,null,null,null,null,null,null,null,214,{"$f":"'Rec. Hos'!C216","v":"M.S.Hospital, Road No.1, Abbanna Colony,\nNear Tirumala By-pass Road, Tirupati, Chittor\nDist."}]
[null,93,null,null,null,null,null,null,null,null,null,215,{"$f":"'Rec. Hos'!C217","v":"Madanapalli Hospitals Pvt. Ltd., Madanapalli,\nC.M.T. Road, Chittor Dist."}]
[null,94,null,null,null,null,null,null,null,null,null,216,{"$f":"'Rec. Hos'!C218","v":"Madhava Nursing Home, 43, Sarojini Devi\nRoad, Secunderabad."}]
[null,95,null,null,null,null,null,null,null,null,null,217,{"$f":"'Rec. Hos'!C219","v":"Madhu Chalapati Urological Hospital,\nJ.P.Road, Bhimavaram, West Godavary Dist."}]
[null,96,null,null,null,null,null,null,null,null,null,218,{"$f":"'Rec. Hos'!C220","v":"Madhukar Reddy Super Speciality Dental\nHospital, 5-7-87, Main Road, Lashkar Bazar,\nOpp. Petrol Pump, Hanamkonda, Warangal"}]
[null,97,null,null,null,null,null,null,null,null,null,219,{"$f":"'Rec. Hos'!C221","v":"Madhumani Nursing Home, Balaji Complex,\nNandyal, Kurnool District."}]
[null,98,null,null,null,null,null,null,null,null,null,220,{"$f":"'Rec. Hos'!C222","v":"Madurai Netralaya, 16-02-280, Beside Market,\nGandhi Nagar, Pogathota, Nellore"}]
[null,99,null,null,null,null,null,null,null,null,null,221,{"$f":"'Rec. Hos'!C223","v":"Mahatma Gandhi Super Speciality Hospitals,\n12-4-2, Prakashnagar, Narsaraopet, Guntur\nDist."}]
[null,100,null,null,null,null,null,null,null,null,null,222,{"$f":"'Rec. Hos'!C224","v":"Mahavir Hospital & Research Centre, 10-1-1,\nBhagwan Mahavir Marg, A.C.Guards, Masab\nTank, Hyderabad"}]
[null,null,null,null,null,null,null,null,null,null,null,223,{"$f":"'Rec. Hos'!C225","v":"Mamatha General Hospital, 5-7-200, Giri\nPrasad Nagar, Urban Mandal, Khammam\nDist."}]
[null,null,null,null,null,null,null,null,null,null,null,224,{"$f":"'Rec. Hos'!C226","v":"Manipal Super Speciality Hospital, Tadepally,\nGuntur Dist."}]
[null,null,null,null,null,null,null,null,null,null,null,225,{"$f":"'Rec. Hos'!C227","v":"Manipal Women and Child Hospital, 18-1-3,\nK.G.Down, Maharanipet, Jagadamba Center,\nVisakhapatnam."}]
[null,null,null,null,null,null,null,null,null,null,null,226,{"$f":"'Rec. Hos'!C228","v":"Manorama Hospital, Khaleelwadi,. Nizamabad"}]
[null,null,null,null,null,null,null,null,null,null,null,227,{"$f":"'Rec. Hos'!C229","v":"Maxivision Laser Centre Pvt. Ltd., 1-11-\n252/1A to 1D, Begumpet, Hyderabad"}]
[null,null,null,null,null,null,null,null,null,null,null,228,{"$f":"'Rec. Hos'!C230","v":"Medi Center Super SpecialtyHospital, 6-2-\n106/C, Ramagiri Road, Nalgonda."}]
[null,null,null,null,null,null,null,null,null,null,null,229,{"$f":"'Rec. Hos'!C231","v":"Medicare Hospitals, 74-11-7, New Prakash\nNagar Round Park, Prakashnagar,\nRajahmundry"}]
[null,null,null,null,null,null,null,null,null,null,null,230,{"$f":"'Rec. Hos'!C232","v":"Medicare Multi Speciality Hospital, 25/466,\nNear RTC Bus Stand, Nandyal, Kurnool Dist."}]
[null,null,null,null,null,null,null,null,null,null,null,231,{"$f":"'Rec. Hos'!C233","v":"Mediciti Hospital, 5-9-22, Secretariat Raod,\nSarovar Complex, Hyderabad - 500063."}]
[null,null,null,null,null,null,null,null,null,null,null,232,{"$f":"'Rec. Hos'!C234","v":"Medivision Eye and Health Care Center, Indira\nSadan, Humayun Nagar Main Road,\nHyderabad."}]
[null,null,null,null,null,null,null,null,null,null,null,233,{"$f":"'Rec. Hos'!C235","v":"Medwin General Hospital, Mankamma Thota,\nKarimnagar."}]
[null,null,null,null,null,null,null,null,null,null,null,234,{"$f":"'Rec. Hos'!C236","v":"Medwin Hospitals, Raghava Ratna Towers,\nChirag Ali Lane, Nampally, Hyderabad"}]
[null,null,null,null,null,null,null,null,null,null,null,235,{"$f":"'Rec. Hos'!C237","v":"Meena Hospital, Sai Ranga Towers,\nThukaram Gate, North Lallaguda,\nSecunderabad -17."}]
[null,null,null,null,null,null,null,null,null,null,null,236,{"$f":"'Rec. Hos'!C238","v":"MNR Medical College & Hospital, Fasalwadi,\nSangareddy, Medak District."}]
[null,null,null,null,null,null,null,null,null,null,null,237,{"$f":"'Rec. Hos'!C239","v":"Modern Eye Hospital, & Research Centre 16-\n11-101, Beside Venkataramana Hotel Lane\nPogathota, Nellore - 524 001"}]
[null,null,null,null,null,null,null,null,null,null,null,238,{"$f":"'Rec. Hos'!C240","v":"Modern Retina Centre, 29-27-5, Kaleswara\nRao Road, Lane to SBI Zonal Office,\nSurayaraopet, Vijayawada"}]
[null,null,null,null,null,null,null,null,null,null,null,239,{"$f":"'Rec. Hos'!C241","v":"MVS Accident Hospital, Near Pushpa Hotel,\nSuryaraopet, Vijayawada"}]
[null,null,null,null,null,null,null,null,null,null,null,240,{"$f":"'Rec. Hos'!C242","v":"Mythri Hospital, 13-6-434/C/148, Near PVNR\nAirport Flyover Pillar No.80, Mehidipatnam,\nHyderabad"}]
[null,null,null,null,null,null,null,null,null,null,null,241,{"$f":"'Rec. Hos'!C243","v":"Mythri Hospital, Chanda Nagar, Hyd."}]
[null,null,null,null,null,null,null,null,null,null,null,242,{"$f":"'Rec. Hos'!C244","v":"Mythri Hospital, D.No. 15-721, Kamalanagar,\nAnantapur"}]
[null,null,null,null,null,null,null,null,null,null,null,243,{"$f":"'Rec. Hos'!C245","v":"Mythri Multi Speciality Hospital, 15-8-18,\nRamakumari Vari Veedhi, Santhampesta,\nOngole, Prakasam Dist."}]
[null,null,null,null,null,null,null,null,null,null,null,244,{"$f":"'Rec. Hos'!C246","v":"Mythri Multi Speciality Hospitals, Ameerpet,\nHyderabad"}]
[null,null,null,null,null,null,null,null,null,null,null,245,{"$f":"'Rec. Hos'!C247","v":"N. N. Speciality Dental Hospital, N.H. 7,\nTirumala Theatre Road, Nirmal, Adilabad."}]
[null,null,null,null,null,null,null,null,null,null,null,246,{"$f":"'Rec. Hos'!C248","v":"Nagabandi Multi SpecialtyDental Hospital, 11-\n3-91/7, Balaji Nagar, Wyra Road, Khammam."}]
[null,null,null,null,null,null,null,null,null,null,null,247,{"$f":"'Rec. Hos'!C249","v":"Nagarjuna Hospitals, Kanuru, Vijayawada-7"}]
[null,null,null,null,null,null,null,null,null,null,null,248,{"$f":"'Rec. Hos'!C250","v":"Nalluri Nursing Home, Kothapatnam Road,\nOngole, Prakasham Dist."}]
[null,null,null,null,null,null,null,null,null,null,null,249,{"$f":"'Rec. Hos'!C251","v":"Narayana Dental College and Hospital,\nNellore"}]
[null,null,null,null,null,null,null,null,null,null,null,250,{"$f":"'Rec. Hos'!C252","v":"Narayana Hrudayalaya, 1-1-216, Suraram 'X'\nRoads, Jeedimetla, Hyderabad"}]
[null,null,null,null,null,null,null,null,null,null,null,251,{"$f":"'Rec. Hos'!C253","v":"Narayana Hrudayalaya. Pvt. Ltd. 258/A,\nBommasandra Industrial Area, Bangalore"}]
[null,null,null,null,null,null,null,null,null,null,null,252,{"$f":"'Rec. Hos'!C254","v":"Narayana Medical College and Hospital,\nChinta Reddy Palem, Nellore"}]
[null,null,null,null,null,null,null,null,null,null,null,253,{"$f":"'Rec. Hos'!C255","v":"Navata Multi Speciality Dental Care Center, 5-\n6-224, Saraswathi Nagar, Opp. RDO Office,\nNizamabad."}]
[null,null,null,null,null,null,null,null,null,null,null,254,{"$f":"'Rec. Hos'!C256","v":"Naveen Chandra Dental Clinic Railway\nStation Road, Rajampeta, Kadapa Dist."}]
[null,null,null,null,null,null,null,null,null,null,null,255,{"$f":"'Rec. Hos'!C257","v":"Naveen Dental Hospital, 151-A, Sri Ram\nStreet, Tirupthi."}]
[null,null,null,null,null,null,null,null,null,null,null,256,{"$f":"'Rec. Hos'!C258","v":"Navya Nethralaya 2-2-349, K.V. Layout, (Near\nLIC Office) Tirupathi"}]
[null,null,null,null,null,null,null,null,null,null,null,257,{"$f":"'Rec. Hos'!C259","v":"Nayana Eye Care, 3-1-50, Srinagar,\nBhanugudi Junction, Kakinada"}]
[null,null,null,null,null,null,null,null,null,null,null,258,{"$f":"'Rec. Hos'!C260","v":"Neoretina Eye Care Institute, 5-9-83/B, Chapel\nRoad, Lane Opp. L.B.Stadium, Nampally,\nAbids, Hyderabad"}]
[null,null,null,null,null,null,null,null,null,null,null,259,{"$f":"'Rec. Hos'!C261","v":"New Life Emergesncy & Multi Speciality\nHospital, NST Road, Khammam"}]
[null,null,null,null,null,null,null,null,null,null,null,260,{"$f":"'Rec. Hos'!C262","v":"New Life Hospital, Kamal Theatre Complex,\nChaderghat, Hyderabad."}]
[null,null,null,null,null,null,null,null,null,null,null,261,{"$f":"'Rec. Hos'!C263","v":"Nightingale Hospital, 17-1-383/N.S/3 & 4,\nOpp. Amber Biscult Factory, Nagarjuna Sagar\nRoad, Hyderabad."}]
[null,null,null,null,null,null,null,null,null,null,null,262,{"$f":"'Rec. Hos'!C264","v":"Nihar Orthopedics and Multi Speciality\nHospital, 8-3-214/2, Murthy Mansion,\nSrinivasa Nagar, Ameerpet, Hyderabad."}]
[null,null,null,null,null,null,null,null,null,null,null,263,{"$f":"'Rec. Hos'!C265","v":"Nirmala Maternity, Orthopedic and General\nHospital, 2/3 R.T. Opp. Post Office,\nVijayanagar Colony, Hyderabad."}]
[null,null,null,null,null,null,null,null,null,null,null,264,{"$f":"'Rec. Hos'!C266","v":"Nizamabad Super Specialty Dental Hospital, 5-\n6-798, 799 - Khaleelwadi, Nizamabad."}]
[null,null,null,null,null,null,null,null,null,null,null,265,{"$f":"'Rec. Hos'!C267","v":"NRI General Hospital, Chinakakani, Guntur\nDistrict."}]
[null,null,null,null,null,null,null,null,null,null,null,266,{"$f":"'Rec. Hos'!C268","v":"Omni Hospitals, Opp. P.V.T. Market\nKothapest 'X' Road, Dilsukhnagar Hyderabad"}]
[null,null,null,null,null,null,null,null,null,null,null,267,{"$f":"'Rec. Hos'!C269","v":"Padma Chandra Super Specialty Hospital,\nOpp. Government Medical College,\nBudhawarpet, Kurnool."}]
[null,null,null,null,null,null,null,null,null,null,null,268,{"$f":"'Rec. Hos'!C270","v":"Padmachandra Super Speciality Hospital,\nOpp. Government Medical College,\nBudhawarapet, Kurnool"}]
[null,null,null,null,null,null,null,null,null,null,null,269,{"$f":"'Rec. Hos'!C271","v":"Park Health Care, 6-3-903/A and B,\nSomajiguda, Hyderabad"}]
[null,null,null,null,null,null,null,null,null,null,null,270,{"$f":"'Rec. Hos'!C272","v":"Partha Dental Hospital & Research Centre,\n600/44/77, P.K. Layout,Tirupathi."}]
[null,null,null,null,null,null,null,null,null,null,null,271,{"$f":"'Rec. Hos'!C273","v":"Partha Dental Hospital & Research Centre,\nRama Talkies Circle , Viskhapatanam"}]
[null,null,null,null,null,null,null,null,null,null,null,272,{"$f":"'Rec. Hos'!C274","v":"Partha Dental Hospital and Research Center,\nNext to T.T.D. Kalyanamandapam, Liberty\nCenter, Hinayathnagar, Hyd."}]
[null,null,null,null,null,null,null,null,null,null,null,273,{"$f":"'Rec. Hos'!C275","v":"Paruchuri Super SpecialtyDental Hospital,\nWyra Road, Khammam"}]
[null,null,null,null,null,null,null,null,null,null,null,274,{"$f":"'Rec. Hos'!C276","v":"Pavani Eye Hospital and YAG Laser Center,\nAshoknagar, Jagityal, Karimnagar"}]
[null,null,null,null,null,null,null,null,null,null,null,275,{"$f":"'Rec. Hos'!C277","v":"Pinnamaneni Care Hospital, Siddhartha\nNagar, Vijayawada"}]
[null,null,null,null,null,null,null,null,null,null,null,276,{"$f":"'Rec. Hos'!C278","v":"Positive Dental Sciesnces Pvt.Ltd., HIG 203,\nDharamareddy Colony, MRO Office, KPHB,\nHyderabad"}]
[null,null,null,null,null,null,null,null,null,null,null,277,{"$f":"'Rec. Hos'!C279","v":"Poulomi Hospital, Rukminipuri Colony, Dr.\nA.S. Rao Nagar, Main Road, Secunderabad."}]
[null,null,null,null,null,null,null,null,null,null,null,278,{"$f":"'Rec. Hos'!C280","v":"Pragati Hospital, Hyderabad Road,\nNizamabad."}]
[null,null,null,null,null,null,null,null,null,null,null,279,{"$f":"'Rec. Hos'!C281","v":"Pragna Children's Hospital, 6-3-347/22/B/1,\nDwarkapuri Colony, Near Sai Baba Temple,\nPunjagutta, Hyderabad"}]
[null,null,null,null,null,null,null,null,null,null,null,280,{"$f":"'Rec. Hos'!C282","v":"Prakash Speciality Dental Clinic, D.No. 18/18,\n60 feet Road, Near RTC Bus Stand, Guntakal,\nAnantapur"}]
[null,null,null,null,null,null,null,null,null,null,null,281,{"$f":"'Rec. Hos'!C283","v":"Pramoda Hospital, 1-8-283, Beside Canara\nBank, Near Ekasila Park, Balasamudram,\nHanamkonda, Warangal"}]
[null,null,null,null,null,null,null,null,null,null,null,282,{"$f":"'Rec. Hos'!C284","v":"Prasad Hospital, MIG-204, Road No.1, Opp.\nSitara Hotel, KPHB Colony, Hyderabad"}]
[null,null,null,null,null,null,null,null,null,null,null,283,{"$f":"'Rec. Hos'!C285","v":"Prasad Multi Speciality Hospital, Near Nellore\nBus Stand, Santhapet, Ongoole, Prakasam\nDistrict"}]
[null,null,null,null,null,null,null,null,null,null,null,284,{"$f":"'Rec. Hos'!C286","v":"Prashanth Hospital, APSEB City Central, Off.\nM.G.Road, Labbipet, Vijayawada"}]
[null,null,null,null,null,null,null,null,null,null,null,285,{"$f":"'Rec. Hos'!C287","v":"Prathima Institute of Medical Sciences,\nNaganoor Road, Karimnagar"}]
[null,null,null,null,null,null,null,null,null,null,null,286,{"$f":"'Rec. Hos'!C288","v":"Praveen Cardiac Centre, H.No. 33-25-35/C,\nPushpa Hotel Road, Kasturibaipet, Bellapu\nsobhanadri Street, Vijayawada"}]
[null,null,null,null,null,null,null,null,null,null,null,287,{"$f":"'Rec. Hos'!C289","v":"Preethi Nursing Home, S.L.V. Talkies Road,\nGuntakal, Ananthapur Dist."}]
[null,null,null,null,null,null,null,null,null,null,null,288,{"$f":"'Rec. Hos'!C290","v":"Premier Hospitals, 1-2-718, Nanal Nagar 'X'\nRoads, Mehidipatnam, Hyderabad."}]
[null,null,null,null,null,null,null,null,null,null,null,289,{"$f":"'Rec. Hos'!C291","v":"Prime Hospitals, Plot No. 4, Mytri Vihar,\nBehind Mytrivanam Buildings, Ameerpet,\nHyderabad."}]
[null,null,null,null,null,null,null,null,null,null,null,290,{"$f":"'Rec. Hos'!C292","v":"Prime Hospitals, Road. No. 1 K.P.H.B Colony\nKukatpally, Hyderabad."}]
[null,null,null,null,null,null,null,null,null,null,null,291,{"$f":"'Rec. Hos'!C293","v":"Princess Durru Shahvar Children's & General\nHospital, Purana Haveli, Hyderabad"}]
[null,null,null,null,null,null,null,null,null,null,null,292,{"$f":"'Rec. Hos'!C294","v":"Prithvi Hospital, 1-7-696, Subedari,\nHanumakonda, Warangal."}]
[null,null,null,null,null,null,null,null,null,null,null,293,{"$f":"'Rec. Hos'!C295","v":"Purna Heart Institute Kovelamudivari Street,\nSuryaraopet,Vijayawada"}]
[null,null,null,null,null,null,null,null,null,null,null,294,{"$f":"'Rec. Hos'!C296","v":"Pushpagiri Eye Institute ( A unit of Pushpagiri\nVitreo Ratia Institute), 241- Uma Plaza, 10-2-\n342, West Paredpally, Secunderabad."}]
[null,null,null,null,null,null,null,null,null,null,null,295,{"$f":"'Rec. Hos'!C297","v":"Queen's N.R.I. Hospital, Gurudwara Lane,\nSeethammadhara, Visakhapatnam."}]
[null,null,null,null,null,null,null,null,null,null,null,296,{"$f":"'Rec. Hos'!C298","v":"R.K. Super Speciality Dental Hospital, Andhra\nBank Complex, Kothapet Cross Roads,\nHyderabad"}]
[null,null,null,null,null,null,null,null,null,null,null,297,{"$f":"'Rec. Hos'!C299","v":"R.R. Hospitals, 40-304-10, Bhagya Nagar,\nKurnool."}]
[null,null,null,null,null,null,null,null,null,null,null,298,{"$f":"'Rec. Hos'!C300","v":"Radhakrishnan Hospitals, Netaji Compound,\nPrakashnagar, Raja Lane, Kurnool"}]
[null,null,null,null,null,null,null,null,null,null,null,299,{"$f":"'Rec. Hos'!C301","v":"Raghavendra Hospital, Opp. Round Building\nE.C.I.L. Cross Roads, Hyderabad."}]
[null,null,null,null,null,null,null,null,null,null,null,300,{"$f":"'Rec. Hos'!C302","v":"Rainbow Children Hospital, Plot No. C-17,\nVikrampuri Colony, Vikrampuri, Hyderabad"}]
[null,null,null,null,null,null,null,null,null,null,null,301,{"$f":"'Rec. Hos'!C303","v":"Rainbow Children's Hospital, 22, Road No.10,\nBanjara Hills, Hyderabad"}]
[null,null,null,null,null,null,null,null,null,null,null,302,{"$f":"'Rec. Hos'!C304","v":"Raju Neuro & Multispeciality Hospital,and\nRaju Emergency Hospital, 76-4-7,\nGandhipuram-II, Rajahmundry"}]
[null,null,null,null,null,null,null,null,null,null,null,303,{"$f":"'Rec. Hos'!C305","v":"Rakesh Syper Speciality Dental Hospital, 16-2-\n835/11/2-A, APHB Main Road, Saidabad\nColony, Hyderabad"}]
[null,null,null,null,null,null,null,null,null,null,null,304,{"$f":"'Rec. Hos'!C306","v":"Ram Hospital, 57/A, Shapur Nagar, IDA\nJeedimetla, Hyderabad-500055"}]
[null,null,null,null,null,null,null,null,null,null,null,305,{"$f":"'Rec. Hos'!C307","v":"Rama Super Speciality Dental Hospital, Shop\nNo.14, Kamshetty Mall, Vishal Super Market\nComplex, T.V.Studio, Ramanthapur,\nHyderabad"}]
[null,null,null,null,null,null,null,null,null,null,null,306,{"$f":"'Rec. Hos'!C308","v":"Ramya Hospitals, 9-11-130, Back Side of\nGandhi Statue, Gandhinagar, Kakinada"}]
[null,null,null,null,null,null,null,null,null,null,null,307,{"$f":"'Rec. Hos'!C309","v":"Ravi Dental Hospital & Implant Centre, Plot\nNo.C-31, Sharadha Theatre Lane,\nRukminipuri Colony, Hyderabad"}]
[null,null,null,null,null,null,null,null,null,null,null,308,{"$f":"'Rec. Hos'!C310","v":"Ravi Institute of Child Health (RICH Hospitals)\n16-11/131, Kasturidevi Nagar, Pogathota,\nNellore"}]
[null,null,null,null,null,null,null,null,null,null,null,309,{"$f":"'Rec. Hos'!C311","v":"Ravichandra Super Speciality Dsental Clinic,\nVasavi Kanyakaparameshwari Temple\nComplex, Mahaboobabad, Warangal Dist."}]
[null,null,null,null,null,null,null,null,null,null,null,310,{"$f":"'Rec. Hos'!C312","v":"Remedy Heart Institute (A unit of Remedy\nHospital Ltd.), Opp. TTD, Himayatnagar,\nHyderabad The name of the\nhospital has been chanded to Hrushikeshya\nHospital (A unit of Remedy Hosptals) and\nshifted to: 2-6-71/a, Bharathnagar Colony,\nNear Masjid, Uppal, hyderabad"}]
[null,null,null,null,null,null,null,null,null,null,null,311,{"$f":"'Rec. Hos'!C313","v":"Remedy Hospitals, Ferozguda, Balanagar,\nHyderabad."}]
[null,null,null,null,null,null,null,null,null,null,null,312,{"$f":"'Rec. Hos'!C314","v":"Remedy Hospitals, Road No.4, KPHB Colony,\nKukatpally, Hyderabad - 500 072"}]
[null,null,null,null,null,null,null,null,null,null,null,313,{"$f":"'Rec. Hos'!C315","v":"RENEE Hospital, Near Old Employement\nOffice, Karimnagar."}]
[null,null,null,null,null,null,null,null,null,null,null,314,{"$f":"'Rec. Hos'!C316","v":"Rohini Medicare (Pvt.) Limited, Subedari,\nHanamkonda - 506 001, Warangal."}]
[null,null,null,null,null,null,null,null,null,null,null,315,{"$f":"'Rec. Hos'!C317","v":"Rohit Text Tube Baby (IVF) Center, Wyra\nRoad, Khammam."}]
[null,null,null,null,null,null,null,null,null,null,null,316,{"$f":"'Rec. Hos'!C318","v":"Royal Hospital, 20-23-4/A, Behind Nagadevi\nTheatre, Near Gokavaram Bus Stand,\nRajahmundry"}]
[null,null,null,null,null,null,null,null,null,null,null,317,{"$f":"'Rec. Hos'!C319","v":"Royal Hospitals, 33-25-45, Kasturi Bai Pet,\nVijayawada"}]
[null,null,null,null,null,null,null,null,null,null,null,318,{"$f":"'Rec. Hos'!C320","v":"Rukku's save-in-smile Cosmetic and Dental\nspecilaity Hospital, Barkatpura, Hyderabad."}]
[null,null,null,null,null,null,null,null,null,null,null,319,{"$f":"'Rec. Hos'!C321","v":"RUSSH Multi Super Speciality Hospital, D.No.\n10-14-576/6, Reddy & Reddy Colony, Opp.\nMunicipal Office, Tirupati, Chittoor Dist."}]
[null,null,null,null,null,null,null,null,null,null,null,320,{"$f":"'Rec. Hos'!C322","v":"S.A.I. Hospitals, Aryapuram, Middle Street,\nOpp. Hotel Lalitha Mahal, Rajahmundry"}]
[null,null,null,null,null,null,null,null,null,null,null,321,{"$f":"'Rec. Hos'!C323","v":"S.S. Dental Hospital, 17-1-23, Opp. K.G.H.\nClock Tower, Maharanipet, Visakhapatnam"}]
[null,null,null,null,null,null,null,null,null,null,null,322,{"$f":"'Rec. Hos'!C324","v":"S.V. Happy Smiles Multi SpecialtyDental\nHospital and Implant Center, 1 and 2 Ground\nFloor, B-5-5-181/2, Near Panama Godown,\nVanasthalipuram, Hyderabad"}]
[null,null,null,null,null,null,null,null,null,null,null,323,{"$f":"'Rec. Hos'!C325","v":"S.V.Pooja Hospital, Plot No.33, Dharma\nReddy Colony, Phase II, Hydsernagar,\nKukatpally, Hyderabad"}]
[null,null,null,null,null,null,null,null,null,null,null,324,{"$f":"'Rec. Hos'!C326","v":"Safe Emergency Hospital, 2-2-7, Usha Priya\nComplex, Bhanugudi, Kakinada, E.G.Dist."}]
[null,null,null,null,null,null,null,null,null,null,null,325,{"$f":"'Rec. Hos'!C327","v":"Sagarlal Memorial Hospital & Matadin Goel\nResearch Centre, 1-5-551, Musheerabad,\nHyderabad"}]
[null,null,null,null,null,null,null,null,null,null,null,326,{"$f":"'Rec. Hos'!C328","v":"Sai Bhavani Super Specialty Hospital, Main\nRoad, Shapur Nagar, Jeedimetla, Hyderabad."}]
[null,null,null,null,null,null,null,null,null,null,null,327,{"$f":"'Rec. Hos'!C329","v":"Sai Care Hospital, Ambedkar Statue,\nHanumakonda, Warangal"}]
[null,null,null,null,null,null,null,null,null,null,null,328,{"$f":"'Rec. Hos'!C330","v":"Sai Krishna Super Speciality Neuro & Trauma\nHospital, Kachiguda, Hyderabad"}]
[null,null,null,null,null,null,null,null,null,null,null,329,{"$f":"'Rec. Hos'!C331","v":"Sai Ram Multi Speciality Hospital, 3-1-398,\nDr.B.R.Ambedkar Road, Beside TDP Office,\nKarimnagar"}]
[null,null,null,null,null,null,null,null,null,null,null,330,{"$f":"'Rec. Hos'!C332","v":"Sai Srinivasa Speciality Pvt., Ltd.,\nNarayanaguda, Hyderabad"}]
[null,null,null,null,null,null,null,null,null,null,null,331,{"$f":"'Rec. Hos'!C333","v":"Sai Vani Hospital, 1-2-365/36/6 & 7,\nRamakrsihna Math Road, Opp. Indira Park,\nDomalguda, Hyderabad"}]
[null,null,null,null,null,null,null,null,null,null,null,332,{"$f":"'Rec. Hos'!C334","v":"Sai Venkata Sai (SVS) Medical College&\nHospital, Yenugonda, Mahabubnagar - 2"}]
[null,null,null,null,null,null,null,null,null,null,null,333,{"$f":"'Rec. Hos'!C335","v":"Sai. Srinidhi Maternita Nursing Home, 11-3-\n1037/1, Opp. Abnus Function Hall, L.B. Nagar,\nWarangal."}]
[null,null,null,null,null,null,null,null,null,null,null,334,{"$f":"'Rec. Hos'!C336","v":"Saiie Dental Speciality Hospital, 40-351,\nGandhi Nagar, Kurool"}]
[null,null,null,null,null,null,null,null,null,null,null,335,{"$f":"'Rec. Hos'!C337","v":"Sanjana Palamoor Nursing Home, D.No. 8-6-\n257/7, Padmavathi Colony, Mahaboobnagar."}]
[null,null,null,null,null,null,null,null,null,null,null,336,{"$f":"'Rec. Hos'!C338","v":"Sanjeevanee Nursing Home, 3-3-163, Behind\nCivil Hospital, Karimnagar"}]
[null,null,null,null,null,null,null,null,null,null,null,337,{"$f":"'Rec. Hos'!C339","v":"Sanjivi Orthopedic and Physio Therapy\nCenter, Laxmipuram Main Road, Guntur"}]
[null,null,null,null,null,null,null,null,null,null,null,338,{"$f":"'Rec. Hos'!C340","v":"Sankar Foundation Eye Hospital, D.No. 16-\n152, Srinivasa Nagar, Simhachalam Road,\nVisakhapatnam - 530027."}]
[null,null,null,null,null,null,null,null,null,null,null,339,{"$f":"'Rec. Hos'!C341","v":"Sankara Eye Hospital, Pedakakani,Guntur\nDist."}]
[null,null,null,null,null,null,null,null,null,null,null,340,{"$f":"'Rec. Hos'!C342","v":"Saradha Dental Hospital, 17-477, Sundaraiah\nStreet, Chittoor"}]
[null,null,null,null,null,null,null,null,null,null,null,341,{"$f":"'Rec. Hos'!C343","v":"Sarojini Hospital, Near Government Hospital,\nSawaran Street, Karimnagar"}]
[null,null,null,null,null,null,null,null,null,null,null,342,{"$f":"'Rec. Hos'!C344","v":"Satya Hospital, Near Laxmi Talkies, JPN\nRaod, Warangal"}]
[null,null,null,null,null,null,null,null,null,null,null,343,{"$f":"'Rec. Hos'!C345","v":"Satya Kidney Centre, Street No.4,\nHimayathnagar, Hyderabad."}]
[null,null,null,null,null,null,null,null,null,null,null,344,{"$f":"'Rec. Hos'!C346","v":"Seha Hospital, Lakdikapool, Hyderabad."}]
[null,null,null,null,null,null,null,null,null,null,null,345,{"$f":"'Rec. Hos'!C347","v":"Seven Hills Hospital, ( Seven Hills Healthcare\nPrivate Ltd.) Rockdale Layout,\nVisakhapatanam"}]
[null,null,null,null,null,null,null,null,null,null,null,346,{"$f":"'Rec. Hos'!C348","v":"Sharat Laser Eye Hospital, D.No. 3-1-119,\nKakatiya Colony, Alankar Circle,\nHanamkonda, Warangal Dist."}]
[null,null,null,null,null,null,null,null,null,null,null,347,{"$f":"'Rec. Hos'!C349","v":"Shashank Hospital, Doctors Street No.1, Opp.\nSheetal Scanning Centre, Khaleelwadi,\nNizamabad"}]
[null,null,null,null,null,null,null,null,null,null,null,348,{"$f":"'Rec. Hos'!C350","v":"Shiva Shree Super SpecialtyDental Care\nHospital, Padmavathi Complex, Khaleel Wadi,\nNizamabad."}]
[null,null,null,null,null,null,null,null,null,null,null,349,{"$f":"'Rec. Hos'!C351","v":"Shravana Hospitals, 5-3-847, Mozamjahi\nMarket, Hyderabad"}]
[null,null,null,null,null,null,null,null,null,null,null,350,{"$f":"'Rec. Hos'!C352","v":"Sibar Charitable Trust (Cancer Hospital),\nGovernorpet,Vijayawada"}]
[null,null,null,null,null,null,null,null,null,null,null,351,{"$f":"'Rec. Hos'!C353","v":"Sibar Institute of Dental Sciences,\nTakkellapadu, Guntur"}]
[null,null,null,null,null,null,null,null,null,null,null,352,{"$f":"'Rec. Hos'!C354","v":"Sigma Hospital, (A Unit of D.B.R Hospital Pvt.\nLtd.,35,S.D. Road, Secunderabad"}]
[null,null,null,null,null,null,null,null,null,null,null,353,{"$f":"'Rec. Hos'!C355","v":"Simhapuri Super Speciality Dental Hospital,\n16/201, Kasturidevi Nagar, Pogathota, Nellore"}]
[null,null,null,null,null,null,null,null,null,null,null,354,{"$f":"'Rec. Hos'!C356","v":"Sindhu Multi Super Speciality Dental Hospital\n& Maxillo-Facial Trauma Care-Implant Centre,\nD.No. 18-399/3, Behind Satyanarayana\nSwamy Temple, Pargi Road, Shadnagar\nTown, Mahaboobnagar Dist."}]
[null,null,null,null,null,null,null,null,null,null,null,355,{"$f":"'Rec. Hos'!C357","v":"Sindhura Hospital, New Bridge Road,\nSrikakulam"}]
[null,null,null,null,null,null,null,null,null,null,null,356,{"$f":"'Rec. Hos'!C358","v":"Singari E.N.T. Hospital and Research Center\nPvt., Ltd., 29-9-54, Govindarajulu Naidu\nStreet, Suryaraopet, Vijayawada"}]
[null,null,null,null,null,null,null,null,null,null,null,357,{"$f":"'Rec. Hos'!C359","v":"Siri Multi Speciality Dental Hospital ( formerely\nSiri Dental Clinic, Narayanaguda, Hyd.) Opp.\nNew Bus Stand, Beside Sagar Medical Store,\nMallikarjunappa Complex, Sangareddy,\nMedak District)"}]
[null,null,null,null,null,null,null,null,null,null,null,358,{"$f":"'Rec. Hos'!C360","v":"Sivarama Hospitals, Opp. Rajarajeswari\nKalyanamandapam, Karimnagar."}]
[null,null,null,null,null,null,null,null,null,null,null,359,{"$f":"'Rec. Hos'!C361","v":"SLMS Hospital Laproscopic & Research\nCentre, Plot No.21, Nagole 'X' Roads,\nHyderabad"}]
[null,null,null,null,null,null,null,null,null,null,null,360,{"$f":"'Rec. Hos'!C362","v":"Smile Care Dental Hospital, 11-9-7, Road\nNo. 1, SBI Colony, Nagole Road, Kothapet,\nHyderabad"}]
[null,null,null,null,null,null,null,null,null,null,null,361,{"$f":"'Rec. Hos'!C363","v":"Smile Care Super Speciality Dental Hospital,\nRCM Complex, Butchirajupalem, Near Andhra\nBank, NAD Kotha Road, Visakhapatnam"}]
[null,null,null,null,null,null,null,null,null,null,null,362,{"$f":"'Rec. Hos'!C364","v":"Smile Crafters Dental Hospital, D.No. 10/432,\nDevi Nursing Home Road, Adimurthy Nagar,\nAnantapur"}]
[null,null,null,null,null,null,null,null,null,null,null,363,{"$f":"'Rec. Hos'!C365","v":"Smile Dental Care, 2-1-50, Narayana Care\nComplex, Backside of Hotel Ishwarya Grand,\nKakinada"}]
[null,null,null,null,null,null,null,null,null,null,null,364,{"$f":"'Rec. Hos'!C366","v":"Smile Super Speciality Dental Hospital,\nRamesh Reddy Nagar, Near RTC Bus Stand,\nNellore"}]
[null,null,null,null,null,null,null,null,null,null,null,365,{"$f":"'Rec. Hos'!C367","v":"Smile Super SpescialityDental Hospital, C-\nCamp Centre, Opp. TTD Kalyana Mandapam,\nKurnool"}]
[null,null,null,null,null,null,null,null,null,null,null,366,{"$f":"'Rec. Hos'!C368","v":"Smiline Dental Hospital Pvt.Ltd., 8-3-\n952/10/2&2/1, Sri Nagar Colony Road,\nPunjagutta, Hyderabad"}]
[null,null,null,null,null,null,null,null,null,null,null,367,{"$f":"'Rec. Hos'!C369","v":"Smt. Bhagwan Devi Hospital, 21-7-191, Mama\nJumla Pathak Charkaman, Hyderabad -\n500002."}]
[null,null,null,null,null,null,null,null,null,null,null,368,{"$f":"'Rec. Hos'!C370","v":"Sneha Hospitals, 5-5-348, Sarojini Devi\nLayout, Old Maternity Ruia Road, Tirupathi."}]
[null,null,null,null,null,null,null,null,null,null,null,369,{"$f":"'Rec. Hos'!C371","v":"Snehalatha Nursing Home, 13-3510, Khaja\nNagar, Opp. Ganga Gowri Cine Complex,\nAnanthapur."}]
[null,null,null,null,null,null,null,null,null,null,null,370,{"$f":"'Rec. Hos'!C372","v":"Soumya Multi Speciality Hospital, Karkhana,\nSecunderabad"}]
[null,null,null,null,null,null,null,null,null,null,null,371,{"$f":"'Rec. Hos'!C373","v":"Spandana Hospitals Heart and Multi\nSpecialities, 8-1-172 and 173, Wyra Road,\nKhammam."}]
[null,null,null,null,null,null,null,null,null,null,null,372,{"$f":"'Rec. Hos'!C374","v":"Sreelatha Hospitals, 12-21-4, Aryapuram,\nRajahmundry, E.G.Dist."}]
[null,null,null,null,null,null,null,null,null,null,null,373,{"$f":"'Rec. Hos'!C375","v":"Sreenivasa Dental Hospital, 15-441-B-14,\nNear Neelam Sanjeeva Reddy Statue,\nSreekantam Circle, R.F.Road, Anantapur"}]
[null,null,null,null,null,null,null,null,null,null,null,374,{"$f":"'Rec. Hos'!C376","v":"Sri Ashwini Hospital, Gayatri Estates, Kurnool."}]
[null,null,null,null,null,null,null,null,null,null,null,375,{"$f":"'Rec. Hos'!C377","v":"Sri Bala Nursing Home, 12-2-24, Danturivari\nStreet, Kakinada, E.G.Dist."}]
[null,null,null,null,null,null,null,null,null,null,null,376,{"$f":"'Rec. Hos'!C378","v":"Sri Devi Eye Hospital, 29-6-13A, Nakkal Road,\nSuryaraopet, Vijayawada."}]
[null,null,null,null,null,null,null,null,null,null,null,377,{"$f":"'Rec. Hos'!C379","v":"Sri Durga Hospital and Brain Center, 15/266\nBrundavanam, Nellore"}]
[null,null,null,null,null,null,null,null,null,null,null,378,{"$f":"'Rec. Hos'!C380","v":"Sri Krishna Multi Speciality Dental Hospital, 3-\n5-8, Govt. Girls Junior College Road,\nKarimnagar"}]
[null,null,null,null,null,null,null,null,null,null,null,379,{"$f":"'Rec. Hos'!C381","v":"Sri Krishna Sahithi Eye Hospital, D.No. 1/500,\nSmith Road, Near Z.P. Hospital, Opp. Y.S.\nGuest House, Kadapa"}]
[null,null,null,null,null,null,null,null,null,null,null,380,{"$f":"'Rec. Hos'!C382","v":"Sri Laxmi Multi Speciality Dental Hospital 10-\n79, Beside RMO Office, Near Ambedkar\nStatue, Gajwel, Pragnapur, Medak Dist."}]
[null,null,null,null,null,null,null,null,null,null,null,381,{"$f":"'Rec. Hos'!C383","v":"Sri Laxmi Nursing Home, Jagitial, Karimnagar\nDist."}]
[null,null,null,null,null,null,null,null,null,null,null,382,{"$f":"'Rec. Hos'!C384","v":"Sri Laxmi Super Speciality Dental Hospital, 3-\n1-343, Beside Old Employemnt Office, Dr.\nAmbed Kar Road, Karimnagar."}]
[null,null,null,null,null,null,null,null,null,null,null,383,{"$f":"'Rec. Hos'!C385","v":"Sri Maithri Hospital, Khaleelwadi, Nizamabad"}]
[null,null,null,null,null,null,null,null,null,null,null,384,{"$f":"'Rec. Hos'!C386","v":"Sri Murali Super Speciality Dental Hospital,\nOpp.Ganga Hotel, Srinivasa Centre, Nandyal,\nKurnool Dist."}]
[null,null,null,null,null,null,null,null,null,null,null,385,{"$f":"'Rec. Hos'!C387","v":"Sri New Balaji Super Speciality Hospital,\n43/19, N.R.Pet, Kurnool"}]
[null,null,null,null,null,null,null,null,null,null,null,386,{"$f":"'Rec. Hos'!C388","v":"Sri Prasanna Kamakshi Super Speciality\nDental Clinic, 2-13-14, Kavali, Nellore\nDistrict"}]
[null,null,null,null,null,null,null,null,null,null,null,387,{"$f":"'Rec. Hos'!C389","v":"Sri Raksha Hospital, 11-5-79, NST Road,\nSanjeeva Reddy Bhavan Backside,\nKhammam"}]
[null,null,null,null,null,null,null,null,null,null,null,388,{"$f":"'Rec. Hos'!C390","v":"Sri Ram Kidney, Infertility and Laproscopic\nCenter, Balaji Nagar, Wyra Road, Khammam."}]
[null,null,null,null,null,null,null,null,null,null,null,389,{"$f":"'Rec. Hos'!C391","v":"Sri Rama Dental Super Specialities, Opp.\nDanavaipet Park Main Gate, Rajahmundry,\nE.G. Dist."}]
[null,null,null,null,null,null,null,null,null,null,null,390,{"$f":"'Rec. Hos'!C392","v":"Sri Rama Devi Multi Specialty Hospital, T.S.\n82, Sairam Street, Tirupathi"}]
[null,null,null,null,null,null,null,null,null,null,null,391,{"$f":"'Rec. Hos'!C393","v":"Sri Rama Multi Speciality Dental Hospital,\nGupta Complex, Beside Municipal Office,\nKamareddy, Nizambad District"}]
[null,null,null,null,null,null,null,null,null,null,null,392,{"$f":"'Rec. Hos'!C394","v":"Sri Rama Multi Speciality Hospital\nJummikunta, Karimnagar District."}]
[null,null,null,null,null,null,null,null,null,null,null,393,{"$f":"'Rec. Hos'!C395","v":"Sri Sai Apollo Super Speciality Dental\nHospital, 11-158, 159, 162, Subhash Road,\nNear Saptagiri Circle, Anantapur"}]
[null,null,null,null,null,null,null,null,null,null,null,394,{"$f":"'Rec. Hos'!C396","v":"Sri Sai Dental Hospital & Implant Centre,\nJagitial, Karimnagar Dist."}]
[null,null,null,null,null,null,null,null,null,null,null,395,{"$f":"'Rec. Hos'!C397","v":"Sri Sai Hospitals, 5/2, Arundalpet, Guntur -\n522002"}]
[null,null,null,null,null,null,null,null,null,null,null,396,{"$f":"'Rec. Hos'!C398","v":"Sri Sai Kidney Center, (A Unit of Twin Cities\nKidney Center Pvt Ltd.), 7-1-59/4/8, Near Lal\nBunglow, Ameerpet, Hyderabad."}]
[null,null,null,null,null,null,null,null,null,null,null,397,{"$f":"'Rec. Hos'!C399","v":"Sri Sai Neuro & Trauma Super Speciality\nHospital, South Bypass Road, Opp.Pragathi\nBhavan, Ongole, Prakasam Dist."}]
[null,null,null,null,null,null,null,null,null,null,null,398,{"$f":"'Rec. Hos'!C400","v":"Sri Sai Nursing Home, 20-692-1, Co-operative\nColony, Beside Nehru Park, Kadapa"}]
[null,null,null,null,null,null,null,null,null,null,null,399,{"$f":"'Rec. Hos'!C401","v":"Sri Sai P.V.R. Hospitals, 8-10-139a, Railway\nStation Road, Behind Leela Mahal Theatre,\nVizianagaram"}]
[null,null,null,null,null,null,null,null,null,null,null,400,{"$f":"'Rec. Hos'!C402","v":"Sri Sai Praja Hospital Pvt.,Ltd., 1-9-228, Opp.\nCivil Hospital Main Gate, Metpally,\nKarimnagar Dist."}]
[null,null,null,null,null,null,null,null,null,null,null,401,{"$f":"'Rec. Hos'!C403","v":"Sri Sai Super Speciality Hospital, Near RTC\nComplex, L.T.Road, Vizianagaram"}]
[null,null,null,null,null,null,null,null,null,null,null,402,{"$f":"'Rec. Hos'!C404","v":"Sri Satya Sai Dental Hospital, 6/880, Near\nNamesthe Road, Shankarapuram, Kadapa"}]
[null,null,null,null,null,null,null,null,null,null,null,403,{"$f":"'Rec. Hos'!C405","v":"Sri Sharanya Nursing Home and Critical Care\nCenter, Hanumakonda, Warangal"}]
[null,null,null,null,null,null,null,null,null,null,null,404,{"$f":"'Rec. Hos'!C406","v":"Sri Surya Dental Hospital, 14-37-4, Krishna\nNagar, Maharanipet, Visakhapatnam"}]
[null,null,null,null,null,null,null,null,null,null,null,405,{"$f":"'Rec. Hos'!C407","v":"Sri Venkata Dental Hospital, Behind Civil\nHospital, Karimnagar."}]
[null,null,null,null,null,null,null,null,null,null,null,406,{"$f":"'Rec. Hos'!C408","v":"Sri Venkata Ramana Dental Hospital, Beside\nSBH, Ashoknagar, Gollapally Road, Jagitial,\nKarimnagar Dist."}]
[null,null,null,null,null,null,null,null,null,null,null,407,{"$f":"'Rec. Hos'!C409","v":"Sri Venkata Sai Medical College Hospital,\nYenugonda, Mahaboobnagar"}]
[null,null,null,null,null,null,null,null,null,null,null,408,{"$f":"'Rec. Hos'!C410","v":"Sri Vijaya Durga Cardiac Centre 46-728-C,\nBudhawarpet, Kurnool"}]
[null,null,null,null,null,null,null,null,null,null,null,409,{"$f":"'Rec. Hos'!C411","v":"Sri Yamini Dental Clinic, Sundaraiah Bhavan\nRoad, Ongole, Prakasam District."}]
[null,null,null,null,null,null,null,null,null,null,null,410,{"$f":"'Rec. Hos'!C412","v":"Sri. Kamakshi Sai Deantal Clinic, 6-2-93,Opp.\nBala Mandir, Old Maternity Hospital, Tirupathi."}]
[null,null,null,null,null,null,null,null,null,null,null,411,{"$f":"'Rec. Hos'!C413","v":"Sricare Dental Hospital, 10-14-545/B,\nV.V.Mahal, Tirupathi"}]
[null,null,null,null,null,null,null,null,null,null,null,412,{"$f":"'Rec. Hos'!C414","v":"Sridhar Super Speciality Dental Hospital, Opp.\nGold Spot, Ameerpet, Hyderabad."}]
[null,null,null,null,null,null,null,null,null,null,null,413,{"$f":"'Rec. Hos'!C415","v":"Srikiran Institution of Ophthalmology,\nPenumarthy Road, Near Atchampeta Institute,\nKakinada, E.G. District"}]
[null,null,null,null,null,null,null,null,null,null,null,414,{"$f":"'Rec. Hos'!C416","v":"Srilatha Modern Eye Hospital, 2-63/1, Officer's\nLane, Opp. Municipal Office, Chittoor."}]
[null,null,null,null,null,null,null,null,null,null,null,415,{"$f":"'Rec. Hos'!C417","v":"Srinidhi Multi Speciality Dental Hospital 23-11-\n48, Sivaji Café Centre, Satyanarayanapuram,\nVijayawada"}]
[null,null,null,null,null,null,null,null,null,null,null,416,{"$f":"'Rec. Hos'!C418","v":"Srinivasa Hospitals, D.No. 20-7-55,\nSundaraiah Bhavan Road, Beside RTC Depot,\nKurnool Road, Ongole, Prakasam Dist."}]
[null,null,null,null,null,null,null,null,null,null,null,417,{"$f":"'Rec. Hos'!C419","v":"Srinivasa Padmavathi Medicare Pvt. Ltd.,\nOpp. Thousand Pillars Temple, Hanamkonda,\nWarangal"}]
[null,null,null,null,null,null,null,null,null,null,null,418,{"$f":"'Rec. Hos'!C420","v":"Srujan Ortho and Accident Care Hospital,\nBalaji Nagar, Khammam."}]
[null,null,null,null,null,null,null,null,null,null,null,419,{"$f":"'Rec. Hos'!C421","v":"St. Ann's Hospital, Fathimanagar, Kazipet,\nWarangal"}]
[null,null,null,null,null,null,null,null,null,null,null,420,{"$f":"'Rec. Hos'!C422","v":"St. Joseph's General Hospital, Opp. A.C.\nCollege, Main Road, Guntur."}]
[null,null,null,null,null,null,null,null,null,null,null,421,{"$f":"'Rec. Hos'!C423","v":"Star Hospitals, Road No. 10, Banjara Hills,\nHyderabad."}]
[null,null,null,null,null,null,null,null,null,null,null,422,{"$f":"'Rec. Hos'!C424","v":"Subham Prema Hospital, Rama Talkies\nJunction, Visakhapatanm."}]
[null,null,null,null,null,null,null,null,null,null,null,423,{"$f":"'Rec. Hos'!C425","v":"Subhash Super Speciality Dental Hospital,\nBeside Navabharat Theatre, Guntur Road,\nOngole, Prakasam Dist."}]
[null,null,null,null,null,null,null,null,null,null,null,424,{"$f":"'Rec. Hos'!C426","v":"Sudarsini Eye Hospital, Kothapet, Main Raod,\nGuntur."}]
[null,null,null,null,null,null,null,null,null,null,null,425,{"$f":"'Rec. Hos'!C427","v":"Sudha Hospital, 21-1-4, Opp. Co-operative\nStores, Tanuku, W.G.Dist."}]
[null,null,null,null,null,null,null,null,null,null,null,426,{"$f":"'Rec. Hos'!C428","v":"Sudha Urology and AndrologyHospital, 10-5-\n8, Nageswara Rao Street, Ramanaraopet, 2nd\nJunction, Kakinada"}]
[null,null,null,null,null,null,null,null,null,null,null,427,{"$f":"'Rec. Hos'!C429","v":"Suhas Multi Speciality Dental Hospital,\n142&143, 1st floor, Navketen Complex, Opp.\nCloct Tower, S.D. Road, Secunderabad."}]
[null,null,null,null,null,null,null,null,null,null,null,428,{"$f":"'Rec. Hos'!C430","v":"Sunshine Hospitals, 1-7-201 to 205,\nPrenderghast Road, Secunderabad"}]
[null,null,null,null,null,null,null,null,null,null,null,429,{"$f":"'Rec. Hos'!C431","v":"Surya Global Hospital, Nageswara Rao Street,\nRamaraopet, Kakinada, East Godavary Dist."}]
[null,null,null,null,null,null,null,null,null,null,null,430,{"$f":"'Rec. Hos'!C432","v":"Surya Nursing Home, Opp. Mission Hospital,\nKarimnagar."}]
[null,null,null,null,null,null,null,null,null,null,null,431,{"$f":"'Rec. Hos'!C433","v":"Surya Sree Hospitals Pvt. Ltd., 15-14-9/1,\nKrishna Nagar, Maharanipeta, Visakhapatnam"}]
[null,null,null,null,null,null,null,null,null,null,null,432,{"$f":"'Rec. Hos'!C434","v":"Susheela Hospitals, 8-3-667/1, Engineers\nColony, Yousufguda Road, Near K.K. Towers,\nHyderabad"}]
[null,null,null,null,null,null,null,null,null,null,null,433,{"$f":"'Rec. Hos'!C435","v":"Susheela Netralaya, Budhvarpet, Kurnool"}]
[null,null,null,null,null,null,null,null,null,null,null,434,{"$f":"'Rec. Hos'!C436","v":"Susrutha Peoples, Hospital, 1-4-80 C, New\nTown, Opp. S.B.H. Bank, Mahaboobnagar."}]
[null,null,null,null,null,null,null,null,null,null,null,435,{"$f":"'Rec. Hos'!C437","v":"SVR Neuro Hospital, 40-1/1-14, ABC,\nLabbipet, Vijayawada"}]
[null,null,null,null,null,null,null,null,null,null,null,436,{"$f":"'Rec. Hos'!C438","v":"SVS Dental Hospital, 7-2-571/6, Opp. Bata,\nR.P. Road, Seceunderabad."}]
[null,null,null,null,null,null,null,null,null,null,null,437,{"$f":"'Rec. Hos'!C439","v":"Swamy Super SpecialtyNetralayam, Naldyal,\nKurnool."}]
[null,null,null,null,null,null,null,null,null,null,null,438,{"$f":"'Rec. Hos'!C440","v":"Swaroop Eye Hospital and Laser Center,\n3/1176, T.B. Road, Proddutur, Kadapa"}]
[null,null,null,null,null,null,null,null,null,null,null,439,{"$f":"'Rec. Hos'!C441","v":"Swarooparani Nursing Home, 23B-5/90,\nRamachandraraopest, Eluru, W.G.Dist."}]
[null,null,null,null,null,null,null,null,null,null,null,440,{"$f":"'Rec. Hos'!C442","v":"Swatantra Hospitals (Multi Specialities) Pvt.\nLtd. Near Kambala Park, Rajahmundry"}]
[null,null,null,null,null,null,null,null,null,null,null,441,{"$f":"'Rec. Hos'!C443","v":"Syamala Hospital, 11-5-15/1, Opp. Zilla\nParishad, Wyra Road, Khammam."}]
[null,null,null,null,null,null,null,null,null,null,null,442,{"$f":"'Rec. Hos'!C444","v":"T.J.R.Dental Hospital, H.No. 1-4-57/6/A,\nRajendra Nagar, Mahaboobnagar"}]
[null,null,null,null,null,null,null,null,null,null,null,443,{"$f":"'Rec. Hos'!C445","v":"The A.J. Multi Specialty Dental Hospital, Shop\nNo.2&3, Gayathri Enclave, Gayathri Estate\nMain Road, Kurnool"}]
[null,null,null,null,null,null,null,null,null,null,null,444,{"$f":"'Rec. Hos'!C446","v":"The Smile Super Speciality Dental Clinic,\nVisakha Medical Centre Building, 1st Floor,\nSLN Towers, Collectorate Junction,\nMaharanipeta, Visakhapatnam"}]
[null,null,null,null,null,null,null,null,null,null,null,445,{"$f":"'Rec. Hos'!C447","v":"Times Hospital, 6-2-413/B, Road No. 4,\nBanjara Hills, Hyderabad"}]
[null,null,null,null,null,null,null,null,null,null,null,446,{"$f":"'Rec. Hos'!C448","v":"Tirumala Nursing Home, Near R.T.C.\nComplex, Vizianagaram."}]
[null,null,null,null,null,null,null,null,null,null,null,447,{"$f":"'Rec. Hos'!C449","v":"Trident Multi Specialty Dental Hospital,\n16/569, Gandhi Nagar, Pogathota, Nellore"}]
[null,null,null,null,null,null,null,null,null,null,null,448,{"$f":"'Rec. Hos'!C450","v":"Triveni Super Speciality Dental Hl. & Implant\nCentre, 2-16-1, Venkat Nagar , Kakinada,\nE.G.Dist."}]
[null,null,null,null,null,null,null,null,null,null,null,449,{"$f":"'Rec. Hos'!C451","v":"Trust Hospitals, Gunttikonda Gopal Rao\nStreet, Kalanagar, Near Benz circle,\nVijayawada."}]
[null,null,null,null,null,null,null,null,null,null,null,450,{"$f":"'Rec. Hos'!C452","v":"Udai Clinic Orthopedic Center, Chappal Road,\nHyderabad."}]
[null,null,null,null,null,null,null,null,null,null,null,451,{"$f":"'Rec. Hos'!C453","v":"Universal Super Speciality Dental Hospital,\nMotinagar X Roads, Plot No. 13-E, 2nd floor,\nKalyananagar, Housing Co-operative Society,\nVenture No.3, Hyderabad"}]
[null,null,null,null,null,null,null,null,null,null,null,452,{"$f":"'Rec. Hos'!C454","v":"Usha Cardiac Centre Ltd., 39-2-11, Pitchaiah\nStreet, M.G.Road, Labbipet, Vijayawada."}]
[null,null,null,null,null,null,null,null,null,null,null,453,{"$f":"'Rec. Hos'!C455","v":"Usha Mullapudi Cardiac Centre,\nGajularamaram, Qutubullahpur Municipality,\nR.R.District, Hyderabad."}]
[null,null,null,null,null,null,null,null,null,null,null,454,{"$f":"'Rec. Hos'!C456","v":"Vamsi Krishna Dental Hospital, 3/27,\nR.S.Road, Near Saibaba Theatre, Opp. Petrol\nPump, Kadapa"}]
[null,null,null,null,null,null,null,null,null,null,null,455,{"$f":"'Rec. Hos'!C457","v":"Vamsi Multispciality Dental Hospital, 102-104,\nIst Floor, Agraj Plaza, Main Road, R.R. Pet,\nEluru, W.G. Dist."}]
[null,null,null,null,null,null,null,null,null,null,null,456,{"$f":"'Rec. Hos'!C458","v":"Vasavi ENT & Cancer Institute, 6-1-91, Opp.\nMeera Theatre, Lakdikapool, Hyderabad -\n500004."}]
[null,null,null,null,null,null,null,null,null,null,null,457,{"$f":"'Rec. Hos'!C459","v":"Vasavi Medical and Research Center, 6-1-\n91, Opp. Meera Theatre, Khairatabad,\nHyderabad"}]
[null,null,null,null,null,null,null,null,null,null,null,458,{"$f":"'Rec. Hos'!C460","v":"Vasvi Eye Hospital, 5-7-17, Khaleelwadi,\nNizamabad."}]
[null,null,null,null,null,null,null,null,null,null,null,459,{"$f":"'Rec. Hos'!C461","v":"Veena Medicares, 6-2-103, Kakati Colony,\nHanamkonda, Warangal Dist."}]
[null,null,null,null,null,null,null,null,null,null,null,460,{"$f":"'Rec. Hos'!C462","v":"Venkata Ramana Nursing Home (P) Ltd.,\nOpp. RTC Bus Stand, Kurnool Road, Ongole,\nPrakasam Dist."}]
[null,null,null,null,null,null,null,null,null,null,null,461,{"$f":"'Rec. Hos'!C463","v":"Venkata Sai Multi SpecialtyDental Hospital,\nGandhi Nagar, Kurnool."}]
[null,null,null,null,null,null,null,null,null,null,null,462,{"$f":"'Rec. Hos'!C464","v":"Venkatapadma Hospitals, 15-1-45, Three\nLamps Junction, Beside Masjid, Vizianagaram"}]
[null,null,null,null,null,null,null,null,null,null,null,463,{"$f":"'Rec. Hos'!C465","v":"Venkateswara KidneyCenter, Ambedkar\nRoad, Karimnagar."}]
[null,null,null,null,null,null,null,null,null,null,null,464,{"$f":"'Rec. Hos'!C466","v":"Viaya Eye Hospital, 4/624, Gandhi Road,\nProddutur, Kadapa Dist."}]
[null,null,null,null,null,null,null,null,null,null,null,465,{"$f":"'Rec. Hos'!C467","v":"Vijaya Eye Hospital, 5-8-104, Lakshimpuram,\nMain Road, Guntur"}]
[null,null,null,null,null,null,null,null,null,null,null,466,{"$f":"'Rec. Hos'!C468","v":"Vijaya Health Care Centre,8-2-\n86,Kummariguda, Near Passport office,\nSecunderabad."}]
[null,null,null,null,null,null,null,null,null,null,null,467,{"$f":"'Rec. Hos'!C469","v":"Vijaya Hospital R.R.Pet. Eluru"}]
[null,null,null,null,null,null,null,null,null,null,null,468,{"$f":"'Rec. Hos'!C470","v":"Vijaya Hospital, Raghava Cine Complex\nRoad, Pogathota, Nellore."}]
[null,null,null,null,null,null,null,null,null,null,null,469,{"$f":"'Rec. Hos'!C471","v":"Vijaya Hospital, Revenue Colony, Nandyal\nRoad, Kurnool."}]
[null,null,null,null,null,null,null,null,null,null,null,470,{"$f":"'Rec. Hos'!C472","v":"Vijaya Super Speciality Dental Hospital, opp.\nRama Talkies, C.B.M. Compound,\nVisakhapatnam."}]
[null,null,null,null,null,null,null,null,null,null,null,471,{"$f":"'Rec. Hos'!C473","v":"Vijaya Super Spesciality Dental Hospital &\nMaxillofacial Trauma Care Centre, 75-8-2,\nGandhipuram-II, Beside RajahmundryGas\nCompany, Rajahmundry, E.G.Dist."}]
[null,null,null,null,null,null,null,null,null,null,null,472,{"$f":"'Rec. Hos'!C474","v":"Vijetha Hospital, Suryaraopet, Eluru Road,\nVijayawada"}]
[null,null,null,null,null,null,null,null,null,null,null,473,{"$f":"'Rec. Hos'!C475","v":"Vinod Dental Super SpecialtyHospital, 46-\n679, 1st Floor, Beside Hotel Laxmi Nivas,\nBudhvarpet, Kurnool"}]
[null,null,null,null,null,null,null,null,null,null,null,474,{"$f":"'Rec. Hos'!C476","v":"Vision Care Clinic and Eye Hospital, 6-2-88\nOld Maty. Hosptial Raod, Bhavani Nagar\nCircle, Tirupathi"}]
[null,null,null,null,null,null,null,null,null,null,null,475,{"$f":"'Rec. Hos'!C477","v":"Viswa Bharathi Cancer Hospital, R.T.Nagar,\nNear Nagalapuram, Kurnool"}]
[null,null,null,null,null,null,null,null,null,null,null,476,{"$f":"'Rec. Hos'!C478","v":"Viswa Bharati Super Speciality Hospital,\nGayatri Estates, Kurnool"}]
[null,null,null,null,null,null,null,null,null,null,null,477,{"$f":"'Rec. Hos'!C479","v":"Vivekananda Hospital, Greenlands Road,\nBegumpet, Hyderabad."}]
[null,null,null,null,null,null,null,null,null,null,null,478,{"$f":"'Rec. Hos'!C480","v":"Vizag Hospital and cancer Research Centre\nPrivate Limtied, 1/7, M.V.P. Colony,\nVisakhapatnam"}]
[null,null,null,null,null,null,null,null,null,null,null,479,{"$f":"'Rec. Hos'!C481","v":"VRLS Memorial Neuro Hospital, D.No. 39-\n17/1A, Sivananda Vari Street, M.G.Road,\nLabbipet, Vijayawada"}]
[null,null,null,null,null,null,null,null,null,null,null,480,{"$f":"'Rec. Hos'!C482","v":"Warangal Hospitals, 11-23-890, Narasampet\nRoad, Pochamma Maidan, Warangal."}]
[null,null,null,null,null,null,null,null,null,null,null,481,{"$f":"'Rec. Hos'!C483","v":"Woodlands Hospital, 30-4-852, Barkatpura,\nHyderabad"}]
[null,null,null,null,null,null,null,null,null,null,null,482,{"$f":"'Rec. Hos'!C484","v":"Yashoda Cancer Hospital, Raj Bhavan Road,\nSomajiguda, Hyderabad"}]
[null,null,null,null,null,null,null,null,null,null,null,483,{"$f":"'Rec. Hos'!C485","v":"Yashoda Hospital, 64, S.P.Road,\nSecunderabad"}]
[null,null,null,null,null,null,null,null,null,null,null,484,{"$f":"'Rec. Hos'!C486","v":"Yashoda Suepr Speciality Hospital (A Unit of\nDatta Chandra Construction & Hospital, Pvt.\nLtd.) Malakpet, Hyderabad"}]
[null,null,null,null,null,null,null,null,null,null,null,485,{"$f":"'Rec. Hos'!C487","v":"Yashoda Super Speciality Hospital, Raj\nBhavan Road, Somajiguda, Hyderabad"}]

{"sheet":"MAIN","index":5,"n_rows":25,"n_cols":26,"rows_kept":25,"cut":false,"hidden":false,"merged":[[2,25,2,26],[22,2,22,19],[1,2,1,22],[5,6,5,7],[4,15,4,18],[12,15,12,18],[3,19,16,19],[20,3,20,16],[17,17,19,17],[18,6,18,9],[12,6,12,12],[17,4,17,16],[12,4,15,4],[4,14,15,14],[5,8,5,12],[9,4,9,5],[6,4,6,5],[7,4,7,5],[11,15,11,18],[11,4,11,5],[5,4,5,5],[5,17,5,18],[6,15,6,16],[8,16,8,18],[8,4,8,5],[24,7,24,8],[24,9,24,15],[8,25,9,26],[1,1,22,1],[13,15,13,18],[19,6,19,12],[8,6,8,12],[3,3,16,3],[10,4,10,5],[13,6,13,12],[4,4,4,12],[7,6,7,12],[15,6,15,12],[3,4,3,18],[19,4,19,5],[14,6,14,12],[24,18,24,24],[3,25,7,26],[19,25,19,26],[21,25,21,26],[10,15,10,18],[7,15,7,18],[18,10,18,15],[10,25,10,26],[11,25,18,26]]}
[]
[]
[null,null,null,null,"MEDICAL REIUMBURSEMENT SOFTWARE",null,null,null,null,null,null,null,null,null,null,null,null,null,null,null,null,null,null,null,null,"Your Hospital Address"]
[null,null,null,null,null,null,null,null,null,null,null,null,null,null,null,null,null,null,null,null,null,null,null,null,null,{"$f":"'Rec. Hos'!O3","v":"Venkatapadma Hospitals, 15-1-45, Three\nLamps Junction, Beside Masjid, Vizianagaram"}]
[null,null,null,null,"PERSONAL DETAILS",null,null,null,null,null,null,null,null,null,null,"PATIENT DETAILS"]
[null,null,null,null,"Name of the Employee",null,2,null,"G.Saivijaya Kumar",null,null,null,null,null,null,"Name ",null,"G.padmavathamma"]
[null,null,null,null,"Designation",null,38,null,null,null,null,null,null,null,null,"Relationship",null,null,"         Age"]
[null,null,null,null,"Place of Working",null,"ZPP. High School, Balayapalli",null,null,null,null,null,null,null,null,"Hospital"]
[null,null,null,null,"Name of the Mandal",null,"Balayapalli",null,null,null,null,null,null,null,null,"Desease","Undrewent Phacoemulsification with IOL implementation left eye and cataract left eye",null,null,null,null,null,null,null,null,{"$f":"\"RC No:\"&'Rec. Hos'!O5","v":"RC No:34435/LC-B/2009"}]
[null,null,null,null,"Name of the District",null,13,null,null,null,null,null,null,null,null,"Amount ",2000]
[null,null,null,null,"Present Scale of Pay",null,24,null,null,null,null,null,null,null,null,"Joining date",null,null,null,null,null,null,null,null,null,{"$f":"\"From \"&'Rec. Hos'!O4&\" To \"&'Rec. Hos'!O7","v":"From 18-2-2010 To 17-2-2013"}]
[null,null,null,null,"Present Basic Pay",null,35,null,null,null,null,null,null,null,null,"Discharge date",null,null,null,null,null,null,null,null,null,{"$f":"'Rec. Hos'!O6","v":"General Medicine, General Surgery,\n Anaesthesiology, OBG, Orthopaedics,\n Neuro Surgery, ENT, Urology,\n Paediatrics, Radiology, Pathology,\n Plastic Surgery, Pulmonoogy and\n Physiotherapy"}]
[null,null,null,null,"Residential Address","H.NO & Street","7-197,PS street",null,null,null,null,null,null,null,null,"submission date"]
[null,null,null,null,null,"Area","Venkatagiri",null,null,null,null,null,null,null,null,"Spell"]
[null,null,null,null,null,"Mandal"]
[null,null,null,null,null,"District"]
[]
[null,null,null,null,"D.D.O. DETAILS"]
[null,null,null,null,"D.D.O","Designation",null,null,null,null,"Place of Working",null,null,null,null,null,"ZPPHS,Balayapalli",null,null,null,null,"ZPPHS,Balayapalli"]
[null,null,null,null," Mandal",null,"District",null,null,null,null,null,null,null,null,null,null,null,null,null,null,null,null,null,null,"Upto November 2010"]
[null,null,null,"a"]
[null,null,null,null,null,null,null,null,null,null,null,null,null,null,null,null,null,null,null,null,null,null,null,null,null,"Total = 485 Hospitals"]
[]
[]
[null,null,null,null,null,null,null,"Visit:",null,"http://www.gsreddy.tk",null,null,null,null,null,null,null,null,"Use Legal Pepar for Printing"]

{"sheet":"Rs","index":6,"n_rows":566,"n_cols":30,"rows_kept":566,"cut":false,"hidden":true,"merged":[[458,0,458,9],[460,6,460,9],[465,0,465,9],[500,0,500,10],[560,6,560,9],[565,0,565,9],[506,6,506,9],[516,0,516,9],[521,6,521,9],[524,6,524,9],[532,0,532,9],[536,6,536,9],[537,6,537,9],[545,0,545,9],[548,6,548,9],[558,0,558,9],[337,6,337,9],[445,0,445,9],[448,6,448,9],[348,6,348,9],[358,0,358,9],[360,6,360,9],[365,0,365,9],[416,0,416,9],[421,6,421,9],[424,6,424,9],[432,0,432,9],[436,6,436,9],[437,6,437,9],[400,0,400,10],[406,6,406,9],[345,0,345,9],[200,0,200,10],[336,6,336,9],[306,6,306,9],[316,0,316,9],[224,6,224,9],[232,0,232,9],[236,6,236,9],[237,6,237,9],[245,0,245,9],[248,6,248,9],[258,0,258,9],[260,6,260,9],[265,0,265,9],[300,0,300,10],[332,0,332,9],[145,0,145,9],[148,6,148,9],[158,0,158,9],[160,6,160,9],[165,0,165,9],[62,0,62,9],[106,6,106,9],[116,0,116,9],[321,6,321,9],[324,6,324,9],[64,6,64,9],[206,6,206,9],[121,6,121,9],[124,6,124,9],[69,0,69,9],[100,0,100,10],[216,0,216,9],[221,6,221,9],[132,0,132,9],[136,6,136,9],[137,6,137,9],[41,6,41,9],[49,0,49,9],[52,6,52,9],[4,0,4,10],[10,6,10,9],[20,0,20,9],[25,6,25,9],[40,6,40,9],[28,6,28,9],[36,0,36,9]]}
[{"$f":"MAIN!$Q$10","v":2000},{"$f":"A70","v":"(Rupees   Two Thousand   and  Zero Only) "},null,null,null,null,null,null,null,null,null,null,null,null,null,null,null,null,null,null,null,null,null,null,null,null,0,"Zero",null,"Ten"]
[null,null,null,null,null,null,null,null,null,null,null,null,null,null,null,null,null,null,null,null,null,null,null,null,null,null,1,"One",null,"Eleven"]
[null,null,null,null,null,null,null,null,null,null,null,null,null,null,null,null,null,null,null,null,null,null,null,null,null,null,2,"Two","Twenty","Twelve"]
[null,null,null,null,null,null,null,null,null,null,null,null,null,null,null,null,null,null,null,null,null,null,null,null,null,null,3,"Three","Thirty","Thirteen"]
["LAKHS CONVERSION",null,null,null,null,null,null,null,null,null,null,null,null,null,null,null,null,null,null,null,null,null,null,null,null,null,4,"Four","Fourty","Fourteen"]
[{"$f":"A1","v":2000},{"$f":"A6/100000","v":0.02},{"$f":"INT(B6)","v":0},null,null,null,"Lakhs",{"$f":"C6","v":0},{"$f":"VLOOKUP(H6,$AA$1:$AB$10,2,FALSE)","v":"Zero"},{"$f":"CONCATENATE(I6,\" Lakhs \")","v":"Zero Lakhs "},null,null,null,null,null,null,null,null,null,null,null,null,null,null,null,null,5,"Five","Fifty","Fifteen"]
[{"$f":"A6-(C6*100000)","v":2000},{"$f":"A7/10000","v":0.2},{"$f":"INT(B7)","v":0},null,null,null,"Ten Thousand",{"$f":"C7","v":0},{"$f":"VLOOKUP(H7,$AA$1:$AB$10,2,FALSE)","v":"Zero"},{"$f":"IF(AND(I7=\"Zero\"),\"\",IF(AND(H7=1),VLOOKUP(H8,$AA$1:$AD$10,4,FALSE),VLOOKUP(I7,$AB$1:$AC$10,2,FALSE)))","v":""},null,null,null,null,null,null,null,null,null,null,null,null,null,null,null,null,6,"Six","Sixty","Sixteen"]
[{"$f":"A7-(C7*10000)","v":2000},{"$f":"A8/1000","v":2},{"$f":"INT(B8)","v":2},null,null,null,"Thousand",{"$f":"C8","v":2},{"$f":"VLOOKUP(H8,$AA$1:$AB$10,2,FALSE)","v":"Two"},{"$f":"IF(AND(I8=\"Zero\"),\" Thousand \",IF(AND(H7=1),\" Thousand \",CONCATENATE(I8,\" Thousand \")))","v":"Two Thousand "},null,null,null,null,null,null,null,null,null,null,null,null,null,null,null,null,7,"Seven","Seventy","Seventeen"]
[{"$f":"A8-(C8*1000)","v":0},{"$f":"A9/100","v":0},{"$f":"INT(B9)","v":0},null,null,null,"Hundred",{"$f":"C9","v":0},{"$f":"VLOOKUP(H9,$AA$1:$AB$10,2,FALSE)","v":"Zero"},{"$f":"IF(I9=\"Zero\",\"\",CONCATENATE(I9,\" Hundred \"))","v":""},null,null,null,null,null,null,null,null,null,null,null,null,null,null,null,null,8,"Eight","Eighty","Eighteen"]
[{"$f":"A9-(C9*100)","v":0},{"$f":"A10/10","v":0},{"$f":"A10","v":0},null,null,null,"Tens",{"$f":"C10","v":0},{"$f":"VLOOKUP(H10,$AA$1:$AB$101,2,FALSE)","v":"Zero"},{"$f":"I10","v":"Zero"},null,null,null,null,null,null,null,null,null,null,null,null,null,null,null,null,9,"Nine","Ninety","Nineteen"]
[null,null,null,null,null,null,{"$f":"CONCATENATE(\"(Rupees \",J6,\" \",J7,\" \",J8,\" \",J9,\" and  \",J10,\" Only) \")","v":"(Rupees Zero Lakhs   Two Thousand   and  Zero Only) "},null,null,null,null,null,null,null,null,null,null,null,null,null,null,null,null,null,null,null,10,"Ten"]
[null,null,null,null,null,null,null,null,null,null,null,null,null,null,null,null,null,null,null,null,null,null,null,null,null,null,11,"Eleven"]
[null,null,null,null,null,null,null,null,null,null,null,null,null,null,null,null,null,null,null,null,null,null,null,null,null,null,12,"Twelve"]
[null,null,null,null,null,null,null,null,null,null,null,null,null,null,null,null,null,null,null,null,null,null,null,null,null,null,13,"Thirteen"]
[null,null,null,null,null,null,null,null,null,null,null,null,null,null,null,null,null,null,null,null,null,null,null,null,null,null,14,"Fourteen"]
[null,null,null,null,null,null,null,null,null,null,null,null,null,null,null,null,null,null,null,null,null,null,null,null,null,null,15,"Fifteen"]
[null,null,null,null,null,null,null,null,null,null,null,null,null,null,null,null,null,null,null,null,null,null,null,null,null,null,16,"Sixteen"]
[null,null,null,null,null,null,null,null,null,null,null,null,null,null,null,null,null,null,null,null,null,null,null,null,null,null,17,"Seventeen"]
[null,null,null,null,null,null,null,null,null,null,null,null,null,null,null,null,null,null,null,null,null,null,null,null,null,null,18,"Eighteen"]
[null,null,null,null,null,null,null,null,null,null,null,null,null,null,null,null,null,null,null,null,null,null,null,null,null,null,19,"Nineteen"]
["TEN THOUSAND CONVERSION",null,null,null,null,null,null,null,null,null,null,null,null,null,null,null,null,null,null,null,null,null,null,null,null,null,20,"Twenty"]
[{"$f":"A1","v":2000},{"$f":"A22/10000","v":0.2},{"$f":"INT(B22)","v":0},null,null,null,"Ten Thousand",{"$f":"C22","v":0},{"$f":"VLOOKUP(H22,$AA$1:$AB$10,2,FALSE)","v":"Zero"},{"$f":"IF(AND(I22=\"Zero\"),\"\",IF(AND(H22=1),VLOOKUP(H23,$AA$1:$AD$10,4,FALSE),VLOOKUP(I22,$AB$1:$AC$10,2,FALSE)))","v":""},null,null,null,null,null,null,null,null,null,null,null,null,null,null,null,null,21,"Twenty One"]
[{"$f":"A22-(C22*10000)","v":2000},{"$f":"A23/1000","v":2},{"$f":"INT(B23)","v":2},null,null,null,"Thousand",{"$f":"C23","v":2},{"$f":"VLOOKUP(H23,$AA$1:$AB$10,2,FALSE)","v":"Two"},{"$f":"IF(AND(I23=\"Zero\"),\" Thousand \",IF(AND(H22=1),\" Thousand \",CONCATENATE(I23,\" Thousand \")))","v":"Two Thousand "},null,null,null,null,null,null,null,null,null,null,null,null,null,null,null,null,22,"Twenty Two"]
[{"$f":"A23-(C23*1000)","v":0},{"$f":"A24/100","v":0},{"$f":"INT(B24)","v":0},null,null,null,"Hundred",{"$f":"C24","v":0},{"$f":"VLOOKUP(H24,$AA$1:$AB$10,2,FALSE)","v":"Zero"},{"$f":"IF(I24=\"Zero\",\"\",CONCATENATE(I24,\" Hundred \"))","v":""},null,null,null,null,null,null,null,null,null,null,null,null,null,null,null,null,23,"Twenty Three"]
[{"$f":"A24-(C24*100)","v":0},{"$f":"A25/10","v":0},{"$f":"A25","v":0},null,null,null,"Tens",{"$f":"C25","v":0},{"$f":"VLOOKUP(H25,$AA$1:$AB$101,2,FALSE)","v":"Zero"},{"$f":"I25","v":"Zero"},null,null,null,null,null,null,null,null,null,null,null,null,null,null,null,null,24,"Twenty Four"]
[null,null,null,null,null,null,{"$f":"CONCATENATE(\"(Rupees \",J21,\" \",J22,\" \",J23,\" \",J24,\" and  \",J25,\" Only) \")","v":"(Rupees   Two Thousand   and  Zero Only) "},null,null,null,null,null,null,null,null,null,null,null,null,null,null,null,null,null,null,null,25,"Twenty Five"]
[null,null,null,null,null,null,null,null,null,null,null,null,null,null,null,null,null,null,null,null,null,null,null,null,null,null,26,"Twenty Six"]
[null,null,null,null,null,null,null,null,null,null,null,null,null,null,null,null,null,null,null,null,null,null,null,null,null,null,27,"Twenty Seven"]
[null,null,null,null,null,null,null,null,null,null,null,null,null,null,null,null,null,null,null,null,null,null,null,null,null,null,28,"Twenty Eight"]
[null,null,null,null,null,null,null,null,null,null,null,null,null,null,null,null,null,null,null,null,null,null,null,null,null,null,29,"Twenty Nine"]
[null,null,null,null,null,null,null,null,null,null,null,null,null,null,null,null,null,null,null,null,null,null,null,null,null,null,30,"Thirty"]
[null,null,null,null,null,null,null,null,null,null,null,null,null,null,null,null,null,null,null,null,null,null,null,null,null,null,31,"Thirty One"]
[null,null,null,null,null,null,null,null,null,null,null,null,null,null,null,null,null,null,null,null,null,null,null,null,null,null,32,"Thirty Two"]
[null,null,null,null,null,null,null,null,null,null,null,null,null,null,null,null,null,null,null,null,null,null,null,null,null,null,33,"Thirty Three"]
[null,null,null,null,null,null,null,null,null,null,null,null,null,null,null,null,null,null,null,null,null,null,null,null,null,null,34,"Thirty Four"]
[null,null,null,null,null,null,null,null,null,null,null,null,null,null,null,null,null,null,null,null,null,null,null,null,null,null,35,"Thirty Five"]
["THOUSAND CONVERSION",null,null,null,null,null,null,null,null,null,null,null,null,null,null,null,null,null,null,null,null,null,null,null,null,null,36,"Thirty Six"]
[{"$f":"A1","v":2000},{"$f":"A38/1000","v":2},{"$f":"INT(B38)","v":2},null,null,null,"Thousand",{"$f":"C38","v":2},{"$f":"VLOOKUP(H38,$AA$1:$AB$10,2,FALSE)","v":"Two"},{"$f":"IF(AND(I38=\"Zero\"),\" Thousand \",IF(AND(H37=1),\" Thousand \",CONCATENATE(I38,\" Thousand \")))","v":"Two Thousand "},null,null,null,null,null,null,null,null,null,null,null,null,null,null,null,null,37,"Thirty Seven"]
[{"$f":"A38-(C38*1000)","v":0},{"$f":"A39/100","v":0},{"$f":"INT(B39)","v":0},null,null,null,"Hundred",{"$f":"C39","v":0},{"$f":"VLOOKUP(H39,$AA$1:$AB$10,2,FALSE)","v":"Zero"},{"$f":"IF(I39=\"Zero\",\"\",CONCATENATE(I39,\" Hundred \"))","v":""},null,null,null,null,null,null,null,null,null,null,null,null,null,null,null,null,38,"Thirty Eight"]
[{"$f":"A39-(C39*100)","v":0},{"$f":"A40/10","v":0},{"$f":"A40","v":0},null,null,null,"Tens",{"$f":"C40","v":0},{"$f":"VLOOKUP(H40,$AA$1:$AB$101,2,FALSE)","v":"Zero"},{"$f":"I40","v":"Zero"},null,null,null,null,null,null,null,null,null,null,null,null,null,null,null,null,39,"Thirty Nine"]
[null,null,null,null,null,null,{"$f":"CONCATENATE(\"(Rupees \",J36,\" \",J37,\" \",J38,\" \",J39,\" and  \",J40,\" Only) \")","v":"(Rupees   Two Thousand   and  Zero Only) "},null,null,null,null,null,null,null,null,null,null,null,null,null,null,null,null,null,null,null,40,"Fourty"]
[null,null,null,null,null,null,null,null,null,null,null,null,null,null,null,null,null,null,null,null,null,null,null,null,null,null,41,"Fourty One"]
[null,null,null,null,null,null,null,null,null,null,null,null,null,null,null,null,null,null,null,null,null,null,null,null,null,null,42,"Fourty Two"]
[null,null,null,null,null,null,null,null,null,null,null,null,null,null,null,null,null,null,null,null,null,null,null,null,null,null,43,"Fourty Three"]
[null,null,null,null,null,null,null,null,null,null,null,null,null,null,null,null,null,null,null,null,null,null,null,null,null,null,44,"Fourty Four"]
[null,null,null,null,null,null,null,null,null,null,null,null,null,null,null,null,null,null,null,null,null,null,null,null,null,null,45,"Fourty Five"]
[null,null,null,null,null,null,null,null,null,null,null,null,null,null,null,null,null,null,null,null,null,null,null,null,null,null,46,"Fourty Six"]
[null,null,null,null,null,null,null,null,null,null,null,null,null,null,null,null,null,null,null,null,null,null,null,null,null,null,47,"Fourty Seven"]
[null,null,null,null,null,null,null,null,null,null,null,null,null,null,null,null,null,null,null,null,null,null,null,null,null,null,48,"Fourty Eight"]
["HUNDRED CONVERSION",null,null,null,null,null,null,null,null,null,null,null,null,null,null,null,null,null,null,null,null,null,null,null,null,null,49,"Fourty Nine"]
[{"$f":"A1","v":2000},{"$f":"A51/100","v":20},{"$f":"INT(B51)","v":20},null,null,null,"Hundred",{"$f":"C51","v":20},{"$f":"VLOOKUP(H51,$AA$1:$AB$10,2,FALSE)","v":{"$error":"#N/A"}},{"$f":"IF(I51=\"Zero\",\"\",CONCATENATE(I51,\" Hundred \"))","v":{"$error":"#N/A"}},null,null,null,null,null,null,null,null,null,null,null,null,null,null,null,null,50,"Fifty"]
[{"$f":"A51-(C51*100)","v":0},{"$f":"A52/10","v":0},{"$f":"A52","v":0},null,null,null,"Tens",{"$f":"C52","v":0},{"$f":"VLOOKUP(H52,$AA$1:$AB$101,2,FALSE)","v":"Zero"},{"$f":"I52","v":"Zero"},null,null,null,null,null,null,null,null,null,null,null,null,null,null,null,null,51,"Fifty One"]
[null,null,null,null,null,null,{"$f":"CONCATENATE(\"(Rupees \",J48,\" \",J49,\" \",J50,\" \",J51,\" and  \",J52,\" Only) \")","v":{"$error":"#N/A"}},null,null,null,null,null,null,null,null,null,null,null,null,null,null,null,null,null,null,null,52,"Fifty Two"]
[null,null,null,null,null,null,null,null,null,null,null,null,null,null,null,null,null,null,null,null,null,null,null,null,null,null,53,"Fifty Three"]
[null,null,null,null,null,null,null,null,null,null,null,null,null,null,null,null,null,null,null,null,null,null,null,null,null,null,54,"Fifty Four"]
[null,null,null,null,null,null,null,null,null,null,null,null,null,null,null,null,null,null,null,null,null,null,null,null,null,null,55,"Fifty Five"]
[null,null,null,null,null,null,null,null,null,null,null,null,null,null,null,null,null,null,null,null,null,null,null,null,null,null,56,"Fifty Six"]
[null,null,null,null,null,null,null,null,null,null,null,null,null,null,null,null,null,null,null,null,null,null,null,null,null,null,57,"Fifty Seven"]
[null,null,null,null,null,null,null,null,null,null,null,null,null,null,null,null,null,null,null,null,null,null,null,null,null,null,58,"Fifty Eight"]
[null,null,null,null,null,null,null,null,null,null,null,null,null,null,null,null,null,null,null,null,null,null,null,null,null,null,59,"Fifty Nine"]
[null,null,null,null,null,null,null,null,null,null,null,null,null,null,null,null,null,null,null,null,null,null,null,null,null,null,60,"Sixty"]
[null,null,null,null,null,null,null,null,null,null,null,null,null,null,null,null,null,null,null,null,null,null,null,null,null,null,61,"Sixty One"]
["HUNDRED CONVERSION",null,null,null,null,null,null,null,null,null,null,null,null,null,null,null,null,null,null,null,null,null,null,null,null,null,62,"Sixty Two"]
[{"$f":"A1","v":2000},{"$f":"A64/10","v":200},{"$f":"A64","v":2000},null,null,null,"Tens",{"$f":"C64","v":2000},{"$f":"VLOOKUP(H64,$AA$1:$AB$101,2,FALSE)","v":{"$error":"#N/A"}},{"$f":"I64","v":{"$error":"#N/A"}},null,null,null,null,null,null,null,null,null,null,null,null,null,null,null,null,63,"Sixty Three"]
[null,null,null,null,null,null,{"$f":"CONCATENATE(\"(Rupees \",J60,\" \",J61,\" \",J62,\" \",J63,\" \",J64,\" Only) \")","v":{"$error":"#N/A"}},null,null,null,null,null,null,null,null,null,null,null,null,null,null,null,null,null,null,null,64,"Sixty Four"]
[null,null,null,null,null,null,null,null,null,null,null,null,null,null,null,null,null,null,null,null,null,null,null,null,null,null,65,"Sixty Five"]
[null,null,null,null,null,null,null,null,null,null,null,null,null,null,null,null,null,null,null,null,null,null,null,null,null,null,66,"Sixty Six"]
[null,null,null,null,null,null,null,null,null,null,null,null,null,null,null,null,null,null,null,null,null,null,null,null,null,null,67,"Sixty Seven"]
[null,null,null,null,null,null,null,null,null,null,null,null,null,null,null,null,null,null,null,null,null,null,null,null,null,null,68,"Sixty Eight"]
[{"$f":"IF(AND(A1>=100000),G11,IF(AND(A1>=10000,A1<=99999),G26,IF(AND(A1>=1000,A1<=9999),G41,IF(AND(A1>=100,A1<=999),G53,G65))))","v":"(Rupees   Two Thousand   and  Zero Only) "},null,null,null,null,null,null,null,null,null,null,null,null,null,null,null,null,null,null,null,null,null,null,null,null,null,69,"Sixty Nine"]
[null,null,null,null,null,null,null,null,null,null,null,null,null,null,null,null,null,null,null,null,null,null,null,null,null,null,70,"Seventy"]
[null,null,null,null,null,null,null,null,null,null,null,null,null,null,null,null,null,null,null,null,null,null,null,null,null,null,71,"Seventy One"]
[null,null,null,null,null,null,null,null,null,null,null,null,null,null,null,null,null,null,null,null,null,null,null,null,null,null,72,"Seventy Two"]
[null,null,null,null,null,null,null,null,null,null,null,null,null,null,null,null,null,null,null,null,null,null,null,null,null,null,73,"Seventy Three"]
[null,null,null,null,null,null,null,null,null,null,null,null,null,null,null,null,null,null,null,null,null,null,null,null,null,null,74,"Seventy Four"]
[null,null,null,null,null,null,null,null,null,null,null,null,null,null,null,null,null,null,null,null,null,null,null,null,null,null,75,"Seventy Five"]
[null,null,null,null,null,null,null,null,null,null,null,null,null,null,null,null,null,null,null,null,null,null,null,null,null,null,76,"Seventy Six"]
[null,null,null,null,null,null,null,null,null,null,null,null,null,null,null,null,null,null,null,null,null,null,null,null,null,null,77,"Seventy Seven"]
[null,null,null,null,null,null,null,null,null,null,null,null,null,null,null,null,null,null,null,null,null,null,null,null,null,null,78,"Seventy Eight"]
[null,null,null,null,null,null,null,null,null,null,null,null,null,null,null,null,null,null,null,null,null,null,null,null,null,null,79,"Seventy Nine"]
[null,null,null,null,null,null,null,null,null,null,null,null,null,null,null,null,null,null,null,null,null,null,null,null,null,null,80,"Eighty"]
[null,null,null,null,null,null,null,null,null,null,null,null,null,null,null,null,null,null,null,null,null,null,null,null,null,null,81,"Eighty one"]
[null,null,null,null,null,null,null,null,null,null,null,null,null,null,null,null,null,null,null,null,null,null,null,null,null,null,82,"Eighty Two"]
[null,null,null,null,null,null,null,null,null,null,null,null,null,null,null,null,null,null,null,null,null,null,null,null,null,null,83,"Eighty Three"]
[null,null,null,null,null,null,null,null,null,null,null,null,null,null,null,null,null,null,null,null,null,null,null,null,null,null,84,"Eighty Four"]
[null,null,null,null,null,null,null,null,null,null,null,null,null,null,null,null,null,null,null,null,null,null,null,null,null,null,85,"Eighty Five"]
[null,null,null,null,null,null,null,null,null,null,null,null,null,null,null,null,null,null,null,null,null,null,null,null,null,null,86,"Eighty Six"]
[null,null,null,null,null,null,null,null,null,null,null,null,null,null,null,null,null,null,null,null,null,null,null,null,null,null,87,"Eighty Seven"]
[null,null,null,null,null,null,null,null,null,null,null,null,null,null,null,null,null,null,null,null,null,null,null,null,null,null,88,"Eighty Eight"]
[null,null,null,null,null,null,null,null,null,null,null,null,null,null,null,null,null,null,null,null,null,null,null,null,null,null,89,"Eighty Nine"]
[null,null,null,null,null,null,null,null,null,null,null,null,null,null,null,null,null,null,null,null,null,null,null,null,null,null,90,"Ninety"]
[null,null,null,null,null,null,null,null,null,null,null,null,null,null,null,null,null,null,null,null,null,null,null,null,null,null,91,"Ninety One"]
[null,null,null,null,null,null,null,null,null,null,null,null,null,null,null,null,null,null,null,null,null,null,null,null,null,null,92,"Ninety Two"]
[null,null,null,null,null,null,null,null,null,null,null,null,null,null,null,null,null,null,null,null,null,null,null,null,null,null,93,"Ninety Three"]
[null,null,null,null,null,null,null,null,null,null,null,null,null,null,null,null,null,null,null,null,null,null,null,null,null,null,94,"Ninety Four"]
[null,null,null,null,null,null,null,null,null,null,null,null,null,null,null,null,null,null,null,null,null,null,null,null,null,null,95,"Ninety Five"]
[null,null,null,null,null,null,null,null,null,null,null,null,null,null,null,null,null,null,null,null,null,null,null,null,null,null,96,"Ninety Six"]
[null,null,null,null,null,null,null,null,null,null,null,null,null,null,null,null,null,null,null,null,null,null,null,null,null,null,97,"Ninety Seven"]
[null,null,null,null,null,null,null,null,null,null,null,null,null,null,null,null,null,null,null,null,null,null,null,null,null,null,98,"Ninety Eighty"]
[{"$f":"Salary!N13+Salary!N14+Salary!N15+Salary!N16+Salary!N17+Salary!N18+Salary!N19-Salary!R13-Salary!R14-Salary!R15-Salary!R16-Salary!R17-Salary!R18-Salary!R19-Salary!R20","v":12298},{"$f":"A166","v":"(Rupees  Twelve  Thousand  Two Hundred  and  Ninety Eighty Only) "},null,null,null,null,null,null,null,null,null,null,null,null,null,null,null,null,null,null,null,null,null,null,null,null,99,"Ninety Nine"]
["LAKHS CONVERSION",null,null,null,null,null,null,null,null,null,null,null,null,null,null,null,null,null,null,null,null,null,null,null,null,null,100,"Hundred"]
[{"$f":"A100","v":12298},{"$f":"A102/100000","v":0.12298000000000001},{"$f":"INT(B102)","v":0},null,null,null,"Lakhs",{"$f":"C102","v":0},{"$f":"VLOOKUP(H102,$AA$1:$AB$10,2,FALSE)","v":"Zero"},{"$f":"CONCATENATE(I102,\" Lakhs \")","v":"Zero Lakhs "}]
[{"$f":"A102-(C102*100000)","v":12298},{"$f":"A103/10000","v":1.2298},{"$f":"INT(B103)","v":1},null,null,null,"Ten Thousand",{"$f":"C103","v":1},{"$f":"VLOOKUP(H103,$AA$1:$AB$10,2,FALSE)","v":"One"},{"$f":"IF(AND(I103=\"Zero\"),\"\",IF(AND(H103=1),VLOOKUP(H104,$AA$1:$AD$10,4,FALSE),VLOOKUP(I103,$AB$1:$AC$10,2,FALSE)))","v":"Twelve"}]
[{"$f":"A103-(C103*10000)","v":2298},{"$f":"A104/1000","v":2.298},{"$f":"INT(B104)","v":2},null,null,null,"Thousand",{"$f":"C104","v":2},{"$f":"VLOOKUP(H104,$AA$1:$AB$10,2,FALSE)","v":"Two"},{"$f":"IF(AND(I104=\"Zero\"),\" Thousand \",IF(AND(H103=1),\" Thousand \",CONCATENATE(I104,\" Thousand \")))","v":" Thousand "}]
[{"$f":"A104-(C104*1000)","v":298},{"$f":"A105/100","v":2.98},{"$f":"INT(B105)","v":2},null,null,null,"Hundred",{"$f":"C105","v":2},{"$f":"VLOOKUP(H105,$AA$1:$AB$10,2,FALSE)","v":"Two"},{"$f":"IF(I105=\"Zero\",\"\",CONCATENATE(I105,\" Hundred \"))","v":"Two Hundred "}]
[{"$f":"A105-(C105*100)","v":98},{"$f":"A106/10","v":9.8000000000000007},{"$f":"A106","v":98},null,null,null,"Tens",{"$f":"C106","v":98},{"$f":"VLOOKUP(H106,$AA$1:$AB$101,2,FALSE)","v":"Ninety Eighty"},{"$f":"I106","v":"Ninety Eighty"}]
[null,null,null,null,null,null,{"$f":"CONCATENATE(\"(Rupees \",J102,\" \",J103,\" \",J104,\" \",J105,\" and  \",J106,\" Only) \")","v":"(Rupees Zero Lakhs  Twelve  Thousand  Two Hundred  and  Ninety Eighty Only) "}]
[]
[]
[]
[]
[]
[]
[]
[]
[]
["TEN THOUSAND CONVERSION"]
[{"$f":"A100","v":12298},{"$f":"A118/10000","v":1.2298},{"$f":"INT(B118)","v":1},null,null,null,"Ten Thousand",{"$f":"C118","v":1},{"$f":"VLOOKUP(H118,$AA$1:$AB$10,2,FALSE)","v":"One"},{"$f":"IF(AND(I118=\"Zero\"),\"\",IF(AND(H118=1),VLOOKUP(H119,$AA$1:$AD$10,4,FALSE),VLOOKUP(I118,$AB$1:$AC$10,2,FALSE)))","v":"Twelve"}]
[{"$f":"A118-(C118*10000)","v":2298},{"$f":"A119/1000","v":2.298},{"$f":"INT(B119)","v":2},null,null,null,"Thousand",{"$f":"C119","v":2},{"$f":"VLOOKUP(H119,$AA$1:$AB$10,2,FALSE)","v":"Two"},{"$f":"IF(AND(I119=\"Zero\"),\" Thousand \",IF(AND(H118=1),\" Thousand \",CONCATENATE(I119,\" Thousand \")))","v":" Thousand "}]
[{"$f":"A119-(C119*1000)","v":298},{"$f":"A120/100","v":2.98},{"$f":"INT(B120)","v":2},null,null,null,"Hundred",{"$f":"C120","v":2},{"$f":"VLOOKUP(H120,$AA$1:$AB$10,2,FALSE)","v":"Two"},{"$f":"IF(I120=\"Zero\",\"\",CONCATENATE(I120,\" Hundred \"))","v":"Two Hundred "}]
[{"$f":"A120-(C120*100)","v":98},{"$f":"A121/10","v":9.8000000000000007},{"$f":"A121","v":98},null,null,null,"Tens",{"$f":"C121","v":98},{"$f":"VLOOKUP(H121,$AA$1:$AB$101,2,FALSE)","v":"Ninety Eighty"},{"$f":"I121","v":"Ninety Eighty"}]
[null,null,null,null,null,null,{"$f":"CONCATENATE(\"(Rupees \",J117,\" \",J118,\" \",J119,\" \",J120,\" and  \",J121,\" Only) \")","v":"(Rupees  Twelve  Thousand  Two Hundred  and  Ninety Eighty Only) "}]
[]
[]
[]
[]
[]
[]
[]
[]
[]
[]
["THOUSAND CONVERSION"]
[{"$f":"A100","v":12298},{"$f":"A134/1000","v":12.298},{"$f":"INT(B134)","v":12},null,null,null,"Thousand",{"$f":"C134","v":12},{"$f":"VLOOKUP(H134,$AA$1:$AB$10,2,FALSE)","v":{"$error":"#N/A"}},{"$f":"IF(AND(I134=\"Zero\"),\" Thousand \",IF(AND(H133=1),\" Thousand \",CONCATENATE(I134,\" Thousand \")))","v":{"$error":"#N/A"}}]
[{"$f":"A134-(C134*1000)","v":298},{"$f":"A135/100","v":2.98},{"$f":"INT(B135)","v":2},null,null,null,"Hundred",{"$f":"C135","v":2},{"$f":"VLOOKUP(H135,$AA$1:$AB$10,2,FALSE)","v":"Two"},{"$f":"IF(I135=\"Zero\",\"\",CONCATENATE(I135,\" Hundred \"))","v":"Two Hundred "}]
[{"$f":"A135-(C135*100)","v":98},{"$f":"A136/10","v":9.8000000000000007},{"$f":"A136","v":98},null,null,null,"Tens",{"$f":"C136","v":98},{"$f":"VLOOKUP(H136,$AA$1:$AB$101,2,FALSE)","v":"Ninety Eighty"},{"$f":"I136","v":"Ninety Eighty"}]
[null,null,null,null,null,null,{"$f":"CONCATENATE(\"(Rupees \",J132,\" \",J133,\" \",J134,\" \",J135,\" and  \",J136,\" Only) \")","v":{"$error":"#N/A"}}]
[]
[]
[]
[]
[]
[]
[]
[]
["HUNDRED CONVERSION"]
[{"$f":"A100","v":12298},{"$f":"A147/100","v":122.98},{"$f":"INT(B147)","v":122},null,null,null,"Hundred",{"$f":"C147","v":122},{"$f":"VLOOKUP(H147,$AA$1:$AB$10,2,FALSE)","v":{"$error":"#N/A"}},{"$f":"IF(I147=\"Zero\",\"\",CONCATENATE(I147,\" Hundred \"))","v":{"$error":"#N/A"}}]
[{"$f":"A147-(C147*100)","v":98},{"$f":"A148/10","v":9.8000000000000007},{"$f":"A148","v":98},null,null,null,"Tens",{"$f":"C148","v":98},{"$f":"VLOOKUP(H148,$AA$1:$AB$101,2,FALSE)","v":"Ninety Eighty"},{"$f":"I148","v":"Ninety Eighty"}]
[null,null,null,null,null,null,{"$f":"CONCATENATE(\"(Rupees \",J144,\" \",J145,\" \",J146,\" \",J147,\" and  \",J148,\" Only) \")","v":{"$error":"#N/A"}}]
[]
[]
[]
[]
[]
[]
[]
[]
[]
["HUNDRED CONVERSION"]
[{"$f":"A100","v":12298},{"$f":"A160/10","v":1229.8},{"$f":"A160","v":12298},null,null,null,"Tens",{"$f":"C160","v":12298},{"$f":"VLOOKUP(H160,$AA$1:$AB$101,2,FALSE)","v":{"$error":"#N/A"}},{"$f":"I160","v":{"$error":"#N/A"}}]
[null,null,null,null,null,null,{"$f":"CONCATENATE(\"(Rupees \",J156,\" \",J157,\" \",J158,\" \",J159,\" \",J160,\" Only) \")","v":{"$error":"#N/A"}}]
[]
[]
[]
[]
[{"$f":"IF(AND(A100>=100000),G107,IF(AND(A100>=10000,A100<=99999),G122,IF(AND(A100>=1000,A100<=9999),G137,IF(AND(A100>=100,A100<=999),G149,G161))))","v":"(Rupees  Twelve  Thousand  Two Hundred  and  Ninety Eighty Only) "}]
[]
[]
[]
[]
[]
[]
[]
[]
[]
[]
[]
[]
[]
[]
[]
[]
[]
[]
[]
[]
[]
[]
[]
[]
[]
[]
[]
[]
[]
[]
[]
[]
[]
[{"$f":"SUM(N13+N14+N15+N16+N17+N18+N19)-SUM(R13-R14-R15-R16-R17-R18-R19-R20)","v":0},{"$f":"A266","v":"(Rupees     Zero Only) "}]
["LAKHS CONVERSION"]
[{"$f":"A200","v":0},{"$f":"A202/100000","v":0},{"$f":"INT(B202)","v":0},null,null,null,"Lakhs",{"$f":"C202","v":0},{"$f":"VLOOKUP(H202,$AA$1:$AB$10,2,FALSE)","v":"Zero"},{"$f":"CONCATENATE(I202,\" Lakhs \")","v":"Zero Lakhs "}]
[{"$f":"A202-(C202*100000)","v":0},{"$f":"A203/10000","v":0},{"$f":"INT(B203)","v":0},null,null,null,"Ten Thousand",{"$f":"C203","v":0},{"$f":"VLOOKUP(H203,$AA$1:$AB$10,2,FALSE)","v":"Zero"},{"$f":"IF(AND(I203=\"Zero\"),\"\",IF(AND(H203=1),VLOOKUP(H204,$AA$1:$AD$10,4,FALSE),VLOOKUP(I203,$AB$1:$AC$10,2,FALSE)))","v":""}]
[{"$f":"A203-(C203*10000)","v":0},{"$f":"A204/1000","v":0},{"$f":"INT(B204)","v":0},null,null,null,"Thousand",{"$f":"C204","v":0},{"$f":"VLOOKUP(H204,$AA$1:$AB$10,2,FALSE)","v":"Zero"},{"$f":"IF(AND(I204=\"Zero\"),\" Thousand \",IF(AND(H203=1),\" Thousand \",CONCATENATE(I204,\" Thousand \")))","v":" Thousand "}]
[{"$f":"A204-(C204*1000)","v":0},{"$f":"A205/100","v":0},{"$f":"INT(B205)","v":0},null,null,null,"Hundred",{"$f":"C205","v":0},{"$f":"VLOOKUP(H205,$AA$1:$AB$10,2,FALSE)","v":"Zero"},{"$f":"IF(I205=\"Zero\",\"\",CONCATENATE(I205,\" Hundred \"))","v":""}]
[{"$f":"A205-(C205*100)","v":0},{"$f":"A206/10","v":0},{"$f":"A206","v":0},null,null,null,"Tens",{"$f":"C206","v":0},{"$f":"VLOOKUP(H206,$AA$1:$AB$101,2,FALSE)","v":"Zero"},{"$f":"I206","v":"Zero"}]
[null,null,null,null,null,null,{"$f":"CONCATENATE(\"(Rupees \",J202,\" \",J203,\" \",J204,\" \",J205,\" and  \",J206,\" Only) \")","v":"(Rupees Zero Lakhs    Thousand   and  Zero Only) "}]
[]
[]
[]
[]
[]
[]
[]
[]
[]
["TEN THOUSAND CONVERSION"]
[{"$f":"A200","v":0},{"$f":"A218/10000","v":0},{"$f":"INT(B218)","v":0},null,null,null,"Ten Thousand",{"$f":"C218","v":0},{"$f":"VLOOKUP(H218,$AA$1:$AB$10,2,FALSE)","v":"Zero"},{"$f":"IF(AND(I218=\"Zero\"),\"\",IF(AND(H218=1),VLOOKUP(H219,$AA$1:$AD$10,4,FALSE),VLOOKUP(I218,$AB$1:$AC$10,2,FALSE)))","v":""}]
[{"$f":"A218-(C218*10000)","v":0},{"$f":"A219/1000","v":0},{"$f":"INT(B219)","v":0},null,null,null,"Thousand",{"$f":"C219","v":0},{"$f":"VLOOKUP(H219,$AA$1:$AB$10,2,FALSE)","v":"Zero"},{"$f":"IF(AND(I219=\"Zero\"),\" Thousand \",IF(AND(H218=1),\" Thousand \",CONCATENATE(I219,\" Thousand \")))","v":" Thousand "}]
[{"$f":"A219-(C219*1000)","v":0},{"$f":"A220/100","v":0},{"$f":"INT(B220)","v":0},null,null,null,"Hundred",{"$f":"C220","v":0},{"$f":"VLOOKUP(H220,$AA$1:$AB$10,2,FALSE)","v":"Zero"},{"$f":"IF(I220=\"Zero\",\"\",CONCATENATE(I220,\" Hundred \"))","v":""}]
[{"$f":"A220-(C220*100)","v":0},{"$f":"A221/10","v":0},{"$f":"A221","v":0},null,null,null,"Tens",{"$f":"C221","v":0},{"$f":"VLOOKUP(H221,$AA$1:$AB$101,2,FALSE)","v":"Zero"},{"$f":"I221","v":"Zero"}]
[null,null,null,null,null,null,{"$f":"CONCATENATE(\"(Rupees \",J217,\" \",J218,\" \",J219,\" \",J220,\" and  \",J221,\" Only) \")","v":"(Rupees    Thousand   and  Zero Only) "}]
[]
[]
[]
[]
[]
[]
[]
[]
[]
[]
["THOUSAND CONVERSION"]
[{"$f":"A200","v":0},{"$f":"A234/1000","v":0},{"$f":"INT(B234)","v":0},null,null,null,"Thousand",{"$f":"C234","v":0},{"$f":"VLOOKUP(H234,$AA$1:$AB$10,2,FALSE)","v":"Zero"},{"$f":"IF(AND(I234=\"Zero\"),\" Thousand \",IF(AND(H233=1),\" Thousand \",CONCATENATE(I234,\" Thousand \")))","v":" Thousand "}]
[{"$f":"A234-(C234*1000)","v":0},{"$f":"A235/100","v":0},{"$f":"INT(B235)","v":0},null,null,null,"Hundred",{"$f":"C235","v":0},{"$f":"VLOOKUP(H235,$AA$1:$AB$10,2,FALSE)","v":"Zero"},{"$f":"IF(I235=\"Zero\",\"\",CONCATENATE(I235,\" Hundred \"))","v":""}]
[{"$f":"A235-(C235*100)","v":0},{"$f":"A236/10","v":0},{"$f":"A236","v":0},null,null,null,"Tens",{"$f":"C236","v":0},{"$f":"VLOOKUP(H236,$AA$1:$AB$101,2,FALSE)","v":"Zero"},{"$f":"I236","v":"Zero"}]
[null,null,null,null,null,null,{"$f":"CONCATENATE(\"(Rupees \",J232,\" \",J233,\" \",J234,\" \",J235,\" and  \",J236,\" Only) \")","v":"(Rupees    Thousand   and  Zero Only) "}]
[]
[]
[]
[]
[]
[]
[]
[]
["HUNDRED CONVERSION"]
[{"$f":"A200","v":0},{"$f":"A247/100","v":0},{"$f":"INT(B247)","v":0},null,null,null,"Hundred",{"$f":"C247","v":0},{"$f":"VLOOKUP(H247,$AA$1:$AB$10,2,FALSE)","v":"Zero"},{"$f":"IF(I247=\"Zero\",\"\",CONCATENATE(I247,\" Hundred \"))","v":""}]
[{"$f":"A247-(C247*100)","v":0},{"$f":"A248/10","v":0},{"$f":"A248","v":0},null,null,null,"Tens",{"$f":"C248","v":0},{"$f":"VLOOKUP(H248,$AA$1:$AB$101,2,FALSE)","v":"Zero"},{"$f":"I248","v":"Zero"}]
[null,null,null,null,null,null,{"$f":"CONCATENATE(\"(Rupees \",J244,\" \",J245,\" \",J246,\" \",J247,\" and  \",J248,\" Only) \")","v":"(Rupees     and  Zero Only) "}]
[]
[]
[]
[]
[]
[]
[]
[]
[]
["HUNDRED CONVERSION"]
[{"$f":"A200","v":0},{"$f":"A260/10","v":0},{"$f":"A260","v":0},null,null,null,"Tens",{"$f":"C260","v":0},{"$f":"VLOOKUP(H260,$AA$1:$AB$101,2,FALSE)","v":"Zero"},{"$f":"I260","v":"Zero"}]
[null,null,null,null,null,null,{"$f":"CONCATENATE(\"(Rupees \",J256,\" \",J257,\" \",J258,\" \",J259,\" \",J260,\" Only) \")","v":"(Rupees     Zero Only) "}]
[]
[]
[]
[]
[{"$f":"IF(AND(A200>=100000),G207,IF(AND(A200>=10000,A200<=99999),G222,IF(AND(A200>=1000,A200<=9999),G237,IF(AND(A200>=100,A200<=999),G249,G261))))","v":"(Rupees     Zero Only) "}]
[]
[]
[]
[]
[]
[]
[]
[]
[]
[]
[]
[]
[]
[]
[]
[]
[]
[]
[]
[]
[]
[]
[]
[]
[]
[]
[]
[]
[]
[]
[]
[]
[]
[46215,{"$f":"A366","v":"(Rupees  Fourty Six Thousand  Two Hundred  and  Fifteen Only) "}]
["LAKHS CONVERSION"]
[{"$f":"A300","v":46215},{"$f":"A302/100000","v":0.46215000000000001},{"$f":"INT(B302)","v":0},null,null,null,"Lakhs",{"$f":"C302","v":0},{"$f":"VLOOKUP(H302,$AA$1:$AB$10,2,FALSE)","v":"Zero"},{"$f":"CONCATENATE(I302,\" Lakhs \")","v":"Zero Lakhs "}]
[{"$f":"A302-(C302*100000)","v":46215},{"$f":"A303/10000","v":4.6215000000000002},{"$f":"INT(B303)","v":4},null,null,null,"Ten Thousand",{"$f":"C303","v":4},{"$f":"VLOOKUP(H303,$AA$1:$AB$10,2,FALSE)","v":"Four"},{"$f":"IF(AND(I303=\"Zero\"),\"\",IF(AND(H303=1),VLOOKUP(H304,$AA$1:$AD$10,4,FALSE),VLOOKUP(I303,$AB$1:$AC$10,2,FALSE)))","v":"Fourty"}]
[{"$f":"A303-(C303*10000)","v":6215},{"$f":"A304/1000","v":6.2149999999999999},{"$f":"INT(B304)","v":6},null,null,null,"Thousand",{"$f":"C304","v":6},{"$f":"VLOOKUP(H304,$AA$1:$AB$10,2,FALSE)","v":"Six"},{"$f":"IF(AND(I304=\"Zero\"),\" Thousand \",IF(AND(H303=1),\" Thousand \",CONCATENATE(I304,\" Thousand \")))","v":"Six Thousand "}]
[{"$f":"A304-(C304*1000)","v":215},{"$f":"A305/100","v":2.15},{"$f":"INT(B305)","v":2},null,null,null,"Hundred",{"$f":"C305","v":2},{"$f":"VLOOKUP(H305,$AA$1:$AB$10,2,FALSE)","v":"Two"},{"$f":"IF(I305=\"Zero\",\"\",CONCATENATE(I305,\" Hundred \"))","v":"Two Hundred "}]
[{"$f":"A305-(C305*100)","v":15},{"$f":"A306/10","v":1.5},{"$f":"A306","v":15},null,null,null,"Tens",{"$f":"C306","v":15},{"$f":"VLOOKUP(H306,$AA$1:$AB$101,2,FALSE)","v":"Fifteen"},{"$f":"I306","v":"Fifteen"}]
[null,null,null,null,null,null,{"$f":"CONCATENATE(\"(Rupees \",J302,\" \",J303,\" \",J304,\" \",J305,\" and  \",J306,\" Only) \")","v":"(Rupees Zero Lakhs  Fourty Six Thousand  Two Hundred  and  Fifteen Only) "}]
[]
[]
[]
[]
[]
[]
[]
[]
[]
["TEN THOUSAND CONVERSION"]
[{"$f":"A300","v":46215},{"$f":"A318/10000","v":4.6215000000000002},{"$f":"INT(B318)","v":4},null,null,null,"Ten Thousand",{"$f":"C318","v":4},{"$f":"VLOOKUP(H318,$AA$1:$AB$10,2,FALSE)","v":"Four"},{"$f":"IF(AND(I318=\"Zero\"),\"\",IF(AND(H318=1),VLOOKUP(H319,$AA$1:$AD$10,4,FALSE),VLOOKUP(I318,$AB$1:$AC$10,2,FALSE)))","v":"Fourty"}]
[{"$f":"A318-(C318*10000)","v":6215},{"$f":"A319/1000","v":6.2149999999999999},{"$f":"INT(B319)","v":6},null,null,null,"Thousand",{"$f":"C319","v":6},{"$f":"VLOOKUP(H319,$AA$1:$AB$10,2,FALSE)","v":"Six"},{"$f":"IF(AND(I319=\"Zero\"),\" Thousand \",IF(AND(H318=1),\" Thousand \",CONCATENATE(I319,\" Thousand \")))","v":"Six Thousand "}]
[{"$f":"A319-(C319*1000)","v":215},{"$f":"A320/100","v":2.15},{"$f":"INT(B320)","v":2},null,null,null,"Hundred",{"$f":"C320","v":2},{"$f":"VLOOKUP(H320,$AA$1:$AB$10,2,FALSE)","v":"Two"},{"$f":"IF(I320=\"Zero\",\"\",CONCATENATE(I320,\" Hundred \"))","v":"Two Hundred "}]
[{"$f":"A320-(C320*100)","v":15},{"$f":"A321/10","v":1.5},{"$f":"A321","v":15},null,null,null,"Tens",{"$f":"C321","v":15},{"$f":"VLOOKUP(H321,$AA$1:$AB$101,2,FALSE)","v":"Fifteen"},{"$f":"I321","v":"Fifteen"}]
[null,null,null,null,null,null,{"$f":"CONCATENATE(\"(Rupees \",J317,\" \",J318,\" \",J319,\" \",J320,\" and  \",J321,\" Only) \")","v":"(Rupees  Fourty Six Thousand  Two Hundred  and  Fifteen Only) "}]
[]
[]
[]
[]
[]
[]
[]
[]
[]
[]
["THOUSAND CONVERSION"]
[{"$f":"A300","v":46215},{"$f":"A334/1000","v":46.215000000000003},{"$f":"INT(B334)","v":46},null,null,null,"Thousand",{"$f":"C334","v":46},{"$f":"VLOOKUP(H334,$AA$1:$AB$10,2,FALSE)","v":{"$error":"#N/A"}},{"$f":"IF(AND(I334=\"Zero\"),\" Thousand \",IF(AND(H333=1),\" Thousand \",CONCATENATE(I334,\" Thousand \")))","v":{"$error":"#N/A"}}]
[{"$f":"A334-(C334*1000)","v":215},{"$f":"A335/100","v":2.15},{"$f":"INT(B335)","v":2},null,null,null,"Hundred",{"$f":"C335","v":2},{"$f":"VLOOKUP(H335,$AA$1:$AB$10,2,FALSE)","v":"Two"},{"$f":"IF(I335=\"Zero\",\"\",CONCATENATE(I335,\" Hundred \"))","v":"Two Hundred "}]
[{"$f":"A335-(C335*100)","v":15},{"$f":"A336/10","v":1.5},{"$f":"A336","v":15},null,null,null,"Tens",{"$f":"C336","v":15},{"$f":"VLOOKUP(H336,$AA$1:$AB$101,2,FALSE)","v":"Fifteen"},{"$f":"I336","v":"Fifteen"}]
[null,null,null,null,null,null,{"$f":"CONCATENATE(\"(Rupees \",J332,\" \",J333,\" \",J334,\" \",J335,\" and  \",J336,\" Only) \")","v":{"$error":"#N/A"}}]
[]
[]
[]
[]
[]
[]
[]
[]
["HUNDRED CONVERSION"]
[{"$f":"A300","v":46215},{"$f":"A347/100","v":462.15},{"$f":"INT(B347)","v":462},null,null,null,"Hundred",{"$f":"C347","v":462},{"$f":"VLOOKUP(H347,$AA$1:$AB$10,2,FALSE)","v":{"$error":"#N/A"}},{"$f":"IF(I347=\"Zero\",\"\",CONCATENATE(I347,\" Hundred \"))","v":{"$error":"#N/A"}}]
[{"$f":"A347-(C347*100)","v":15},{"$f":"A348/10","v":1.5},{"$f":"A348","v":15},null,null,null,"Tens",{"$f":"C348","v":15},{"$f":"VLOOKUP(H348,$AA$1:$AB$101,2,FALSE)","v":"Fifteen"},{"$f":"I348","v":"Fifteen"}]
[null,null,null,null,null,null,{"$f":"CONCATENATE(\"(Rupees \",J344,\" \",J345,\" \",J346,\" \",J347,\" and  \",J348,\" Only) \")","v":{"$error":"#N/A"}}]
[]
[]
[]
[]
[]
[]
[]
[]
[]
["HUNDRED CONVERSION"]
[{"$f":"A300","v":46215},{"$f":"A360/10","v":4621.5},{"$f":"A360","v":46215},null,null,null,"Tens",{"$f":"C360","v":46215},{"$f":"VLOOKUP(H360,$AA$1:$AB$101,2,FALSE)","v":{"$error":"#N/A"}},{"$f":"I360","v":{"$error":"#N/A"}}]
[null,null,null,null,null,null,{"$f":"CONCATENATE(\"(Rupees \",J356,\" \",J357,\" \",J358,\" \",J359,\" \",J360,\" Only) \")","v":{"$error":"#N/A"}}]
[]
[]
[]
[]
[{"$f":"IF(AND(A300>=100000),G307,IF(AND(A300>=10000,A300<=99999),G322,IF(AND(A300>=1000,A300<=9999),G337,IF(AND(A300>=100,A300<=999),G349,G361))))","v":"(Rupees  Fourty Six Thousand  Two Hundred  and  Fifteen Only) "}]
[]
[]
[]
[]
[]
[]
[]
[]
[]
[]
[]
[]
[]
[]
[]
[]
[]
[]
[]
[]
[]
[]
[]
[]
[]
[]
[]
[]
[]
[]
[]
[]
[]
[4215,{"$f":"A466","v":"(Rupees   Four Thousand  Two Hundred  and  Fifteen Only) "}]
["LAKHS CONVERSION"]
[{"$f":"A400","v":4215},{"$f":"A402/100000","v":4.215E-2},{"$f":"INT(B402)","v":0},null,null,null,"Lakhs",{"$f":"C402","v":0},{"$f":"VLOOKUP(H402,$AA$1:$AB$10,2,FALSE)","v":"Zero"},{"$f":"CONCATENATE(I402,\" Lakhs \")","v":"Zero Lakhs "}]
[{"$f":"A402-(C402*100000)","v":4215},{"$f":"A403/10000","v":0.42149999999999999},{"$f":"INT(B403)","v":0},null,null,null,"Ten Thousand",{"$f":"C403","v":0},{"$f":"VLOOKUP(H403,$AA$1:$AB$10,2,FALSE)","v":"Zero"},{"$f":"IF(AND(I403=\"Zero\"),\"\",IF(AND(H403=1),VLOOKUP(H404,$AA$1:$AD$10,4,FALSE),VLOOKUP(I403,$AB$1:$AC$10,2,FALSE)))","v":""}]
[{"$f":"A403-(C403*10000)","v":4215},{"$f":"A404/1000","v":4.2149999999999999},{"$f":"INT(B404)","v":4},null,null,null,"Thousand",{"$f":"C404","v":4},{"$f":"VLOOKUP(H404,$AA$1:$AB$10,2,FALSE)","v":"Four"},{"$f":"IF(AND(I404=\"Zero\"),\" Thousand \",IF(AND(H403=1),\" Thousand \",CONCATENATE(I404,\" Thousand \")))","v":"Four Thousand "}]
[{"$f":"A404-(C404*1000)","v":215},{"$f":"A405/100","v":2.15},{"$f":"INT(B405)","v":2},null,null,null,"Hundred",{"$f":"C405","v":2},{"$f":"VLOOKUP(H405,$AA$1:$AB$10,2,FALSE)","v":"Two"},{"$f":"IF(I405=\"Zero\",\"\",CONCATENATE(I405,\" Hundred \"))","v":"Two Hundred "}]
[{"$f":"A405-(C405*100)","v":15},{"$f":"A406/10","v":1.5},{"$f":"A406","v":15},null,null,null,"Tens",{"$f":"C406","v":15},{"$f":"VLOOKUP(H406,$AA$1:$AB$101,2,FALSE)","v":"Fifteen"},{"$f":"I406","v":"Fifteen"}]
[null,null,null,null,null,null,{"$f":"CONCATENATE(\"(Rupees \",J402,\" \",J403,\" \",J404,\" \",J405,\" and  \",J406,\" Only) \")","v":"(Rupees Zero Lakhs   Four Thousand  Two Hundred  and  Fifteen Only) "}]
[]
[]
[]
[]
[]
[]
[]
[]
[]
["TEN THOUSAND CONVERSION"]
[{"$f":"A400","v":4215},{"$f":"A418/10000","v":0.42149999999999999},{"$f":"INT(B418)","v":0},null,null,null,"Ten Thousand",{"$f":"C418","v":0},{"$f":"VLOOKUP(H418,$AA$1:$AB$10,2,FALSE)","v":"Zero"},{"$f":"IF(AND(I418=\"Zero\"),\"\",IF(AND(H418=1),VLOOKUP(H419,$AA$1:$AD$10,4,FALSE),VLOOKUP(I418,$AB$1:$AC$10,2,FALSE)))","v":""}]
[{"$f":"A418-(C418*10000)","v":4215},{"$f":"A419/1000","v":4.2149999999999999},{"$f":"INT(B419)","v":4},null,null,null,"Thousand",{"$f":"C419","v":4},{"$f":"VLOOKUP(H419,$AA$1:$AB$10,2,FALSE)","v":"Four"},{"$f":"IF(AND(I419=\"Zero\"),\" Thousand \",IF(AND(H418=1),\" Thousand \",CONCATENATE(I419,\" Thousand \")))","v":"Four Thousand "}]
[{"$f":"A419-(C419*1000)","v":215},{"$f":"A420/100","v":2.15},{"$f":"INT(B420)","v":2},null,null,null,"Hundred",{"$f":"C420","v":2},{"$f":"VLOOKUP(H420,$AA$1:$AB$10,2,FALSE)","v":"Two"},{"$f":"IF(I420=\"Zero\",\"\",CONCATENATE(I420,\" Hundred \"))","v":"Two Hundred "}]
[{"$f":"A420-(C420*100)","v":15},{"$f":"A421/10","v":1.5},{"$f":"A421","v":15},null,null,null,"Tens",{"$f":"C421","v":15},{"$f":"VLOOKUP(H421,$AA$1:$AB$101,2,FALSE)","v":"Fifteen"},{"$f":"I421","v":"Fifteen"}]
[null,null,null,null,null,null,{"$f":"CONCATENATE(\"(Rupees \",J417,\" \",J418,\" \",J419,\" \",J420,\" and  \",J421,\" Only) \")","v":"(Rupees   Four Thousand  Two Hundred  and  Fifteen Only) "}]
[]
[]
[]
[]
[]
[]
[]
[]
[]
[]
["THOUSAND CONVERSION"]
[{"$f":"A400","v":4215},{"$f":"A434/1000","v":4.2149999999999999},{"$f":"INT(B434)","v":4},null,null,null,"Thousand",{"$f":"C434","v":4},{"$f":"VLOOKUP(H434,$AA$1:$AB$10,2,FALSE)","v":"Four"},{"$f":"IF(AND(I434=\"Zero\"),\" Thousand \",IF(AND(H433=1),\" Thousand \",CONCATENATE(I434,\" Thousand \")))","v":"Four Thousand "}]
[{"$f":"A434-(C434*1000)","v":215},{"$f":"A435/100","v":2.15},{"$f":"INT(B435)","v":2},null,null,null,"Hundred",{"$f":"C435","v":2},{"$f":"VLOOKUP(H435,$AA$1:$AB$10,2,FALSE)","v":"Two"},{"$f":"IF(I435=\"Zero\",\"\",CONCATENATE(I435,\" Hundred \"))","v":"Two Hundred "}]
[{"$f":"A435-(C435*100)","v":15},{"$f":"A436/10","v":1.5},{"$f":"A436","v":15},null,null,null,"Tens",{"$f":"C436","v":15},{"$f":"VLOOKUP(H436,$AA$1:$AB$101,2,FALSE)","v":"Fifteen"},{"$f":"I436","v":"Fifteen"}]
[null,null,null,null,null,null,{"$f":"CONCATENATE(\"(Rupees \",J432,\" \",J433,\" \",J434,\" \",J435,\" and  \",J436,\" Only) \")","v":"(Rupees   Four Thousand  Two Hundred  and  Fifteen Only) "}]
[]
[]
[]
[]
[]
[]
[]
[]
["HUNDRED CONVERSION"]
[{"$f":"A400","v":4215},{"$f":"A447/100","v":42.15},{"$f":"INT(B447)","v":42},null,null,null,"Hundred",{"$f":"C447","v":42},{"$f":"VLOOKUP(H447,$AA$1:$AB$10,2,FALSE)","v":{"$error":"#N/A"}},{"$f":"IF(I447=\"Zero\",\"\",CONCATENATE(I447,\" Hundred \"))","v":{"$error":"#N/A"}}]
[{"$f":"A447-(C447*100)","v":15},{"$f":"A448/10","v":1.5},{"$f":"A448","v":15},null,null,null,"Tens",{"$f":"C448","v":15},{"$f":"VLOOKUP(H448,$AA$1:$AB$101,2,FALSE)","v":"Fifteen"},{"$f":"I448","v":"Fifteen"}]
[null,null,null,null,null,null,{"$f":"CONCATENATE(\"(Rupees \",J444,\" \",J445,\" \",J446,\" \",J447,\" and  \",J448,\" Only) \")","v":{"$error":"#N/A"}}]
[]
[]
[]
[]
[]
[]
[]
[]
[]
["HUNDRED CONVERSION"]
[{"$f":"A400","v":4215},{"$f":"A460/10","v":421.5},{"$f":"A460","v":4215},null,null,null,"Tens",{"$f":"C460","v":4215},{"$f":"VLOOKUP(H460,$AA$1:$AB$101,2,FALSE)","v":{"$error":"#N/A"}},{"$f":"I460","v":{"$error":"#N/A"}}]
[null,null,null,null,null,null,{"$f":"CONCATENATE(\"(Rupees \",J456,\" \",J457,\" \",J458,\" \",J459,\" \",J460,\" Only) \")","v":{"$error":"#N/A"}}]
[]
[]
[]
[]
[{"$f":"IF(AND(A400>=100000),G407,IF(AND(A400>=10000,A400<=99999),G422,IF(AND(A400>=1000,A400<=9999),G437,IF(AND(A400>=100,A400<=999),G449,G461))))","v":"(Rupees   Four Thousand  Two Hundred  and  Fifteen Only) "}]
[]
[]
[]
[]
[]
[]
[]
[]
[]
[]
[]
[]
[]
[]
[]
[]
[]
[]
[]
[]
[]
[]
[]
[]
[]
[]
[]
[]
[]
[]
[]
[]
[]
[45005,{"$f":"A566","v":"(Rupees  Fourty Five Thousand   and  Five Only) "}]
["LAKHS CONVERSION"]
[{"$f":"A500","v":45005},{"$f":"A502/100000","v":0.45005000000000001},{"$f":"INT(B502)","v":0},null,null,null,"Lakhs",{"$f":"C502","v":0},{"$f":"VLOOKUP(H502,$AA$1:$AB$10,2,FALSE)","v":"Zero"},{"$f":"CONCATENATE(I502,\" Lakhs \")","v":"Zero Lakhs "}]
[{"$f":"A502-(C502*100000)","v":45005},{"$f":"A503/10000","v":4.5004999999999997},{"$f":"INT(B503)","v":4},null,null,null,"Ten Thousand",{"$f":"C503","v":4},{"$f":"VLOOKUP(H503,$AA$1:$AB$10,2,FALSE)","v":"Four"},{"$f":"IF(AND(I503=\"Zero\"),\"\",IF(AND(H503=1),VLOOKUP(H504,$AA$1:$AD$10,4,FALSE),VLOOKUP(I503,$AB$1:$AC$10,2,FALSE)))","v":"Fourty"}]
[{"$f":"A503-(C503*10000)","v":5005},{"$f":"A504/1000","v":5.0049999999999999},{"$f":"INT(B504)","v":5},null,null,null,"Thousand",{"$f":"C504","v":5},{"$f":"VLOOKUP(H504,$AA$1:$AB$10,2,FALSE)","v":"Five"},{"$f":"IF(AND(I504=\"Zero\"),\" Thousand \",IF(AND(H503=1),\" Thousand \",CONCATENATE(I504,\" Thousand \")))","v":"Five Thousand "}]
[{"$f":"A504-(C504*1000)","v":5},{"$f":"A505/100","v":0.05},{"$f":"INT(B505)","v":0},null,null,null,"Hundred",{"$f":"C505","v":0},{"$f":"VLOOKUP(H505,$AA$1:$AB$10,2,FALSE)","v":"Zero"},{"$f":"IF(I505=\"Zero\",\"\",CONCATENATE(I505,\" Hundred \"))","v":""}]
[{"$f":"A505-(C505*100)","v":5},{"$f":"A506/10","v":0.5},{"$f":"A506","v":5},null,null,null,"Tens",{"$f":"C506","v":5},{"$f":"VLOOKUP(H506,$AA$1:$AB$101,2,FALSE)","v":"Five"},{"$f":"I506","v":"Five"}]
[null,null,null,null,null,null,{"$f":"CONCATENATE(\"(Rupees \",J502,\" \",J503,\" \",J504,\" \",J505,\" and  \",J506,\" Only) \")","v":"(Rupees Zero Lakhs  Fourty Five Thousand   and  Five Only) "}]
[]
[]
[]
[]
[]
[]
[]
[]
[]
["TEN THOUSAND CONVERSION"]
[{"$f":"A500","v":45005},{"$f":"A518/10000","v":4.5004999999999997},{"$f":"INT(B518)","v":4},null,null,null,"Ten Thousand",{"$f":"C518","v":4},{"$f":"VLOOKUP(H518,$AA$1:$AB$10,2,FALSE)","v":"Four"},{"$f":"IF(AND(I518=\"Zero\"),\"\",IF(AND(H518=1),VLOOKUP(H519,$AA$1:$AD$10,4,FALSE),VLOOKUP(I518,$AB$1:$AC$10,2,FALSE)))","v":"Fourty"}]
[{"$f":"A518-(C518*10000)","v":5005},{"$f":"A519/1000","v":5.0049999999999999},{"$f":"INT(B519)","v":5},null,null,null,"Thousand",{"$f":"C519","v":5},{"$f":"VLOOKUP(H519,$AA$1:$AB$10,2,FALSE)","v":"Five"},{"$f":"IF(AND(I519=\"Zero\"),\" Thousand \",IF(AND(H518=1),\" Thousand \",CONCATENATE(I519,\" Thousand \")))","v":"Five Thousand "}]
[{"$f":"A519-(C519*1000)","v":5},{"$f":"A520/100","v":0.05},{"$f":"INT(B520)","v":0},null,null,null,"Hundred",{"$f":"C520","v":0},{"$f":"VLOOKUP(H520,$AA$1:$AB$10,2,FALSE)","v":"Zero"},{"$f":"IF(I520=\"Zero\",\"\",CONCATENATE(I520,\" Hundred \"))","v":""}]
[{"$f":"A520-(C520*100)","v":5},{"$f":"A521/10","v":0.5},{"$f":"A521","v":5},null,null,null,"Tens",{"$f":"C521","v":5},{"$f":"VLOOKUP(H521,$AA$1:$AB$101,2,FALSE)","v":"Five"},{"$f":"I521","v":"Five"}]
[null,null,null,null,null,null,{"$f":"CONCATENATE(\"(Rupees \",J517,\" \",J518,\" \",J519,\" \",J520,\" and  \",J521,\" Only) \")","v":"(Rupees  Fourty Five Thousand   and  Five Only) "}]
[]
[]
[]
[]
[]
[]
[]
[]
[]
[]
["THOUSAND CONVERSION"]
[{"$f":"A500","v":45005},{"$f":"A534/1000","v":45.005000000000003},{"$f":"INT(B534)","v":45},null,null,null,"Thousand",{"$f":"C534","v":45},{"$f":"VLOOKUP(H534,$AA$1:$AB$10,2,FALSE)","v":{"$error":"#N/A"}},{"$f":"IF(AND(I534=\"Zero\"),\" Thousand \",IF(AND(H533=1),\" Thousand \",CONCATENATE(I534,\" Thousand \")))","v":{"$error":"#N/A"}}]
[{"$f":"A534-(C534*1000)","v":5},{"$f":"A535/100","v":0.05},{"$f":"INT(B535)","v":0},null,null,null,"Hundred",{"$f":"C535","v":0},{"$f":"VLOOKUP(H535,$AA$1:$AB$10,2,FALSE)","v":"Zero"},{"$f":"IF(I535=\"Zero\",\"\",CONCATENATE(I535,\" Hundred \"))","v":""}]
[{"$f":"A535-(C535*100)","v":5},{"$f":"A536/10","v":0.5},{"$f":"A536","v":5},null,null,null,"Tens",{"$f":"C536","v":5},{"$f":"VLOOKUP(H536,$AA$1:$AB$101,2,FALSE)","v":"Five"},{"$f":"I536","v":"Five"}]
[null,null,null,null,null,null,{"$f":"CONCATENATE(\"(Rupees \",J532,\" \",J533,\" \",J534,\" \",J535,\" and  \",J536,\" Only) \")","v":{"$error":"#N/A"}}]
[]
[]
[]
[]
[]
[]
[]
[]
["HUNDRED CONVERSION"]
[{"$f":"A500","v":45005},{"$f":"A547/100","v":450.05},{"$f":"INT(B547)","v":450},null,null,null,"Hundred",{"$f":"C547","v":450},{"$f":"VLOOKUP(H547,$AA$1:$AB$10,2,FALSE)","v":{"$error":"#N/A"}},{"$f":"IF(I547=\"Zero\",\"\",CONCATENATE(I547,\" Hundred \"))","v":{"$error":"#N/A"}}]
[{"$f":"A547-(C547*100)","v":5},{"$f":"A548/10","v":0.5},{"$f":"A548","v":5},null,null,null,"Tens",{"$f":"C548","v":5},{"$f":"VLOOKUP(H548,$AA$1:$AB$101,2,FALSE)","v":"Five"},{"$f":"I548","v":"Five"}]
[null,null,null,null,null,null,{"$f":"CONCATENATE(\"(Rupees \",J544,\" \",J545,\" \",J546,\" \",J547,\" and  \",J548,\" Only) \")","v":{"$error":"#N/A"}}]
[]
[]
[]
[]
[]
[]
[]
[]
[]
["HUNDRED CONVERSION"]
[{"$f":"A500","v":45005},{"$f":"A560/10","v":4500.5},{"$f":"A560","v":45005},null,null,null,"Tens",{"$f":"C560","v":45005},{"$f":"VLOOKUP(H560,$AA$1:$AB$101,2,FALSE)","v":{"$error":"#N/A"}},{"$f":"I560","v":{"$error":"#N/A"}}]
[null,null,null,null,null,null,{"$f":"CONCATENATE(\"(Rupees \",J556,\" \",J557,\" \",J558,\" \",J559,\" \",J560,\" Only) \")","v":{"$error":"#N/A"}}]
[]
[]
[]
[]
[{"$f":"IF(AND(A500>=100000),G507,IF(AND(A500>=10000,A500<=99999),G522,IF(AND(A500>=1000,A500<=9999),G537,IF(AND(A500>=100,A500<=999),G549,G561))))","v":"(Rupees  Fourty Five Thousand   and  Five Only) "}]

{"sheet":"Employee Letter","index":7,"n_rows":44,"n_cols":17,"rows_kept":44,"cut":false,"hidden":false,"merged":[[15,1,15,18],[29,11,29,18],[35,2,35,6],[32,11,32,18],[33,11,33,18],[36,27,36,30],[35,11,35,18],[32,2,32,7],[32,27,32,32],[34,11,34,18],[1,19,2,21],[8,1,8,2],[14,3,14,18],[16,1,26,18],[31,11,31,18],[31,1,31,4],[12,3,12,18],[13,3,13,18],[6,2,6,11],[1,16,1,18],[4,2,4,11],[5,2,5,11],[9,3,11,18],[1,13,1,15],[3,2,3,11],[28,2,28,7],[43,27,43,32],[33,2,33,9],[42,2,42,7],[37,2,37,6],[36,2,36,6],[38,2,38,6],[34,27,34,31],[37,27,37,30],[43,2,43,7],[39,2,39,6],[40,2,40,6],[34,2,34,6],[35,27,35,31],[38,27,38,32],[41,2,41,10],[33,27,33,30]]}
[]
[null,null,null,null,null,null,null,null,null,null,null,null,null,"Date:",null,null,{"$f":"Mandals1!AB86","v":"24-11-2011"}]
[null,"To"]
[null,null,{"$f":"\"The\"&\" \"&Code!O31","v":"The Principal"}]
[null,null,{"$f":"Code!O32","v":"ZPPHS,Balayapalli"}]
[null,null,{"$f":"Code!O33","v":"Chinnamandem "}]
[null,null,{"$f":"Code!O34","v":"Kaddapah District"}]
[]
[null,{"$f":"Code!E62","v":"sir"}]
[null,null,"Sub:",{"$f":"CONCATENATE(\"Request to sanction the Medical Reimbursement in repect of \",UPPER(Code!R30),\", \",Code!R31,\", \",Code!R32,\", \",Code!R33,\", \",Code!R34,\" - \",\"Proposals submitted - Reg.\")","v":"Request to sanction the Medical Reimbursement in repect of SRI. G.SAIVIJAYA KUMAR, School Assistant (Phy. Edn.), ZPP. High School, Balayapalli, Jammikunta, Kareemnagar District  - Proposals submitted - Reg."}]
[]
[]
[null,null,"Ref:","1. G.O. Ms.No. 74, M&H Dept., dated: 15-03-2005."]
[null,null,null,"2. G.O. Ms.No. 105, M&H Dept., dated: 09-04-2007."]
[null,null,null,"3. Medical Bills issued by the Doctor concerned."]
[null,"----"]
[null,{"$f":"CONCATENATE(\"With reference to the subject cited, I submit here with the Medical Bills with all the enclosures for Medical Reimbursement for an amount of Rs. \",Code!Z13,Code!W8,\" \",Code!AL26,\" \",UPPER(MAIN!Q9),\" in the Recognised Hospital by the Andhra Pradesh State Government i.e., at \",Code!O1,\" during the period from \",Mandals1!R86, \" to \",Mandals1!W86,\" and onward transmit to the higher authorities for further necessary action in the matter at an early date.\")","v":"With reference to the subject cited, I submit here with the Medical Bills with all the enclosures for Medical Reimbursement for an amount of Rs. 2000-00(Rupees   Two Thousand   and  Zero Only)  as I have undergone Treatment for the desease UNDREWENT PHACOEMULSIFICATION WITH IOL IMPLEMENTATION LEFT EYE AND CATARACT LEFT EYE in the Recognised Hospital by the Andhra Pradesh State Government i.e., at Venkatapadma Hospitals, 15-1-45, Three\nLamps Junction, Beside Masjid, Vizianagaram during the period from 17-7-2010 to 21-6-2011 and onward transmit to the higher authorities for further necessary action in the matter at an early date."}]
[]
[]
[]
[]
[]
[]
[]
[]
[]
[]
[]
[null,null,{"$f":"CONCATENATE(\"Thanking You \",Code!E62,\".\")","v":"Thanking You sir."}]
[null,null,null,null,null,null,null,null,null,null,null,"Yours faithfully,"]
[]
[null,"Enclosures:",null,null,null,null,null,null,null,null,null,{"$f":"CONCATENATE(\"(\",UPPER(Code!R30),\")\")","v":"(SRI. G.SAIVIJAYA KUMAR)"}]
[null,null,"Requisition letter to HM.",null,null,null,null,null,null,null,null,{"$f":"CONCATENATE(Code!R31,\",\")","v":"School Assistant (Phy. Edn.),"}]
[null,null,"Requisition letter from HM to DEO.",null,null,null,null,null,null,null,null,{"$f":"CONCATENATE(Code!R32,\",\")","v":"ZPP. High School, Balayapalli,"}]
[null,null,"Salary certifcate",null,null,null,null,null,null,null,null,{"$f":"CONCATENATE(Code!R33,\",\")","v":"Jammikunta,"}]
[null,null,"Appendix II",null,null,null,null,null,null,null,null,{"$f":"CONCATENATE(Code!R34,\".\")","v":"Kareemnagar District ."}]
[null,null,"Form -C"]
[null,null,"Check List"]
[null,null,"Essentiality Certificate"]
[null,null,"Dependent Certificate"]
[null,null,"Availment certificate"]
[null,null,"Non-Drawl Certificate"]
[null,null,"Discharge summary"]
[null,null,"Medical Bills"]

{"sheet":"DDO Letter","index":8,"n_rows":53,"n_cols":16,"rows_kept":53,"cut":false,"hidden":false,"merged":[[1,22,1,24],[1,1,1,21],[46,12,46,20],[21,1,35,21],[2,1,2,8],[20,1,20,21],[11,1,11,8],[17,5,17,21],[9,2,9,20],[16,3,16,4],[3,3,3,11],[4,3,4,11],[5,3,5,11],[6,3,6,11],[4,13,4,20],[3,13,3,20],[16,5,16,21],[13,3,13,4],[13,5,15,21],[47,12,47,20],[5,13,5,20],[37,2,37,11],[18,5,18,21],[44,3,44,8],[47,3,47,9],[19,5,19,21],[39,2,39,8],[52,3,52,8],[40,3,40,10],[41,3,41,12],[42,3,42,10],[45,3,45,8],[46,3,46,7],[50,3,50,11],[51,3,51,8],[49,3,49,10],[48,12,48,20],[41,15,41,21],[48,3,48,9]]}
[]
[null,"GOVERNMENT OF ANDHRA PRADESH\nDEPARTMENT OF SCHOOL EDUCATION"]
[null,"From",null,null,null,null,null,null,null,null,null,null,"To"]
[null,null,null,{"$f":"'Employee Letter'!C4","v":"The Principal"},null,null,null,null,null,null,null,null,null,{"$f":"IF(MAIN!Q10>25000,Code!T32,Code!T30)","v":"The District Educational Officer"}]
[null,null,null,{"$f":"'Employee Letter'!C5","v":"ZPPHS,Balayapalli"},null,null,null,null,null,null,null,null,null,{"$f":"IF($N$4=\"The District Educational Officer\",Code!O34,Code!T33)","v":"Kaddapah District"}]
[null,null,null,{"$f":"'Employee Letter'!C6","v":"Chinnamandem "},null,null,null,null,null,null,null,null,null,{"$f":"IF($N$4=\"The District Educational Officer\",\" \",Code!T34)","v":" "}]
[null,null,null,{"$f":"'Employee Letter'!C7","v":"Kaddapah District"}]
[]
[]
[null,null,"Lr. No. __________, Dt: __________ ."]
[]
[null,"Respected Sir,"]
[]
[null,null,null,"Sub:",null,{"$f":"'Employee Letter'!D10","v":"Request to sanction the Medical Reimbursement in repect of SRI. G.SAIVIJAYA KUMAR, School Assistant (Phy. Edn.), ZPP. High School, Balayapalli, Jammikunta, Kareemnagar District  - Proposals submitted - Reg."}]
[]
[]
[null,null,null,"Ref:",null,"1. G.O. Ms.No. 74, M&H Dept., dated: 15-03-2005."]
[null,null,null,null,null,"2. G.O.Ms.No. 105, M&H Dept., dated: 09-04-2007."]
[null,null,null,null,null,"3. Medical Bills issued by the Doctor concerned."]
[null,null,null,null,null,{"$f":"CONCATENATE(\"4. Proposals received from the incumbent dated:\",Mandals1!AB86)","v":"4. Proposals received from the incumbent dated:24-11-2011"}]
[null,"----"]
[null,{"$f":"Code!W14&MAIN!$Q$10&Rs!B1&Code!Y17&\"undergone Treatment for desease\"&MAIN!Q9&\" in the Recognised Hopital by the Andhra Pradesh State Government i.e., at \"&Code!O1&\" during the period from \"&Mandals1!R86&\" to \"&Mandals1!W86&\" and onward transmit to the higher authorities for further necessary action at an early date.\"","v":"                With reference to the subject cited, I submit herewith the Medical Bills with all the enclosures submitted by SRI. G.SAIVIJAYA KUMAR, School Assistant (Phy. Edn.), ZPP. High School, Balayapalli, Jammikunta, Kareemnagar District  for your kind sanction of the Medical Reimbursement for an amount of Rs. 2000(Rupees   Two Thousand   and  Zero Only) as heundergone Treatment for deseaseUndrewent Phacoemulsification with IOL implementation left eye and cataract left eye in the Recognised Hopital by the Andhra Pradesh State Government i.e., at Venkatapadma Hospitals, 15-1-45, Three\nLamps Junction, Beside Masjid, Vizianagaram during the period from 17-7-2010 to 21-6-2011 and onward transmit to the higher authorities for further necessary action at an early date."}]
[]
[]
[]
[]
[]
[]
[]
[]
[]
[]
[]
[]
[]
[]
[]
[null,null,"Thanking You Sir."]
[]
[null,null,"Enclosures:"]
[null,null,null,"Requisition letter to HM."]
[null,null,null,"Requisition letter from HM to DEO.",null,null,null,null,null,null,null,null,null,null,null,"Yours Sincearly,"]
[null,null,null,"Salary certifcate"]
[null,null,null,"Appendix II"]
[null,null,null,{"$f":"'Employee Letter'!C36","v":"Appendix II"}]
[null,null,null,"Form -C"]
[null,null,null,"Check List"]
[null,null,null,"Essentiality Certificate"]
[null,null,null,"Dependent Certificate"]
[null,null,null,"Availment certificate"]
[null,null,null,"Non-Drawl Certificate"]
[null,null,null,"Discharge summary"]
[null,null,null,"Medical Bills"]

{"sheet":"Mandals1","index":9,"n_rows":119,"n_cols":33,"rows_kept":119,"cut":false,"hidden":true,"merged":[]}
[null,null,null,null,null,null,null,null,null,null,null,null,null,null,null,null,null,null,null,null,null,null,null,null,8,{"$f":"LOOKUP(Y1,Y3:Z25,Z3:Z25)","v":"Kareemnagar District "},5,null,null,null,null,10,{"$f":"LOOKUP(AF1,AF3:AG25,AG3:AG25)","v":"Krishan District "}]
[null,"Adilabad ","Anathapuram","Chittoor District","West godavari District ","Guntur District","Hyderabad   District ","kaddapah District","Kareemnagar District ","Khammam District ","Krishan District ","Kurnool District","Mahaboobnagar District ","Medak District ","Nalgonda District ","Nizamabad District ","Nellore District","Prakasam District","Ranga reddy District ","Sreekakulam District ","Visakhapatnam District","Vizianagaram District","Warangal District ","West godavari  District ","S.No","Districts",{"$f":"LOOKUP(AA1,Y3:Y68,AA3:AA68)","v":"Dharmapuri"},null,15,{"$f":"LOOKUP(AC2,Y3:AA68,AA3:AA68)","v":"Jammikunta"},null,"S.No","Districts"]
[1,"Adilabad ","Agali ","B Kothakota","Achanta","Achampeta",null,"Atlur ","Bheemadevarpalle","Aswapuram ","A Konduru ","Adoni  ","Achampeta","Alladurg","Alair ","Armur ","Allur","Addanki","Balanagar ","Amadalavalasa ","Anakapalli","Badangi","Atmakur  ","Achanta",1,"Adilabad ",{"$f":" HLOOKUP($Z$1,$B$2:$X$68,AB3,FALSE)","v":"Bheemadevarpalle"},2,null,null,null,1,"Adilabad "]
[2,"Narnoor","Amadagur","Baireddi Palle","Akiveedu","Amaravathi ",null,"B Kodur ","Boinpalle","Aswaraopeta","Agiripalle","Allagadda","Addakal","Andole","Anumula","Balkonda","Ananthasagaram","Ardhaveedu","Bantaram","Battili","Anandapuram ","Balajipeta","Bachannapeta","Akiveedu",2,"Anathapuram","Boinpalle",3,null,null,null,2,"Anathapuram"]
[3,"Bela","Amarapuram","Bangarupalem","Attili","Amruthalur ",null,"Badvel ","Chandurthi","Bayyaram","Avanigadda","Alur","Aiza ","Chegunta","Atmakur ","Banswada","Anumasamudrampeta","Ballikuruva ","Basheerabad","Bhamini","Ananthagiri","Bhoghapuram","Bhupalpalle","Attili",3,"Chittoor District","Chandurthi",4,null,null,null,3,"Chittoor District"]
[4,"Boath","Anantapur","Buchinaidu Khandriga","Bheemavaram","Bapatla ",null,"Brahmamgarimattam ","Choppadandi","Bhadrachalam ","Bantumilli","Aspari","Alampur","Chinna Kodur","Atmakur","Bheemgal","Atmakur","Bestavaripeta ","Chevella","Burja","Araku Valley","Bobbili","Chennaraopet","Bheemavaram",4,"West godavari District ","Choppadandi",5,null,null,null,4,"West godavari District "]
[5,"Dilawarpur","Atmakur","Chandragiri","Bhimadole","Bellamkonda",null,"Chakrayapet","Dharmapuri","Bonakal ","Bapulapadu","Atmakur","Amangal","Doultabad","Bhuvanagiri","Bhiknur","Balayapalli","Chadrasekara Puram  ","Dharur","Etcherla","Atchutapuram ","Bondapalle","Cheriyal","Bhimadole",5,"Guntur District","Dharmapuri",6,null,null,null,5,"Guntur District"]
[6,"Jainad","Bathalapalle","Chinnagottigallu","Buttayagudem","Bhattiprolu ",null,"Chapad ","Dharmaram","Burgampadu","Challapalli ","Banaganapalle","Amrabad","Dubbak","Bibinagar","Bichkunda","Bogole","Chimakurthi ","Domah","Ganguvari Singadam","Bheemunipatnam","Chintalavalasa","Chityal","Buttayagudem",6,"Hyderabad District ","Dharmaram",7,null,null,null,6,"Hyderabad District "]
[7,"Kaddampeddur","Beluguppa","Chittoor","Chagallu","Bollapalle ",null,"Chennur","Ellanthakunta","Chandrugonda","Chandarlapadu","Bandi Atmakur","Atmakur","Eddumailaram","Bommalaramaram","Birkoor ","Buchireddipalem","Chinaganjam ","Gandeed","Kaligapatnam","Butchayyapeta ","Cheepurupalle","Devaruppula","Chagallu",7,"Kaddapah District","Ellanthakunta",8,null,null,null,7,"Kaddapah District"]
[8,"Khanpur","Bommanahal","Chowdepalle","Chintalapudi","Chebrole ",null,"ChinnaChowk ","Gambhiraopet","Cherla","Chatrai","Bethamcherla","Balanagar","Gajwel","Chandam Pet","Bodhan","Chejerla ","Chirala ","Ghatkesar","Hiramandalam","Cheedikada","Dattirajeru","Dharmasagar","Chintalapudi",8,"Kareemnagar District ","Gambhiraopet",9,null,null,null,8,"Kareemnagar District "]
[9,"Kuntala","Brahmasamudram ","Gangadhara Nellore","Denduluru","Cherukupalle ",null,"Chinnamandem ","Gangadhara","Chinthakani","G Konduru","Bugganipalle","Balmoor","Hathnoora","Chandur","Dhar Palle","Chillakur ","Cumbum ","Hayathnagar","Ichchapuram","Chintapalle","Denkada","Dornakal","Denduluru",9,"Khammam District ","Gangadhara",10,null,null,null,9,"Khammam District "]
[10,"Mamda","Bukkapatnam","Gangavaram  ","Devarapalle","Chilakaluripet ",null,"Chintha Kommadinne ","Gollapalle","Chintur","Gampalagudem","C.Belagal","Bhoothpur ","Jagdevpur","Chilkur","Dich Palle","Chittamur ","Darsi ","Ibrahimpatam","Jalumuru","Chodavaram","Gajapathinagaram","Duggondi","Devarapalle",10,"Krishan District ","Gollapalle",11,null,null,null,10,"Krishan District "]
[11,"Rebbana","Bukkarayasamudram","Gudi Palle  ","Dwaraka Tirumala","Dachepalle ",null,"Chitvel ","Husnabad","Dammapeta","Gannavaram","Chagalamarri","Bijinapalle","Jharasangam","Chintha Palle","Domakonda","Dagadarthi ","Donakonda","Kandukur","Kanchili","Devarapalle","Gantyada","Eturnagaram ","Dwaraka Tirumala",11,"Kurnool District","Husnabad",12,null,null,null,11,"Kurnool District"]
[12,"Talamadugu","Chenne Kothapalle","Gudipala ","Eluru","Duggirala ",null,"Cuddapah ","Huzurabad","Dummugudem","Ghantasala","Chippagiri","Bomraspeta","Jinnaram","Chityala","Gandhari","Dakkili","Dornala ","Keesara","Kaviti","Dumbriguda","Garividi","Geesugonda","Eluru",12,"Mahaboobnagar District ","Huzurabad",13,null,null,null,12,"Mahaboobnagar District "]
[13,"Tiryani","Chilamathur","Gurramkonda  ","Ganapavaram","Durgi ",null,"Duvvur  ","Ibrahimpatnam","Enkuru","Gudivada","Devanakonda","Chinna Chinta Kunta","Kalher","Chivvemla","Jakranpalle","Doravarisatram","Giddaluru ","Kulkacharla","Kotabommili","Gajuwaka","Garugubilli","Ghanapur","Ganapavaram",13,"Medak District ","Ibrahimpatnam",14,null,null,null,13,"Medak District "]
[14,"Asifabad","D.Hirchal","Irala ","Gopalapuram","Edlapadu",null,"Galiveedu ","Jagtial","Garla","Gudlavalleru","Dhone","Damaragidda","Kohir","Choutuppal","Jukkal","Duttalur ","Gudluru ","Maheswaram","Kothuru ","Gangaraju Madugula","Gummalakshmipuram","Ghanpur(Stn)","Gopalapuram",14,"Nalgonda District ","Jagtial",15,null,null,null,14,"Nalgonda District "]
[15,"Bellampalle","Dharmavaram","K V P Puram ","Iragavaram","Guntur ",null,"Gopavaram","Jammikunta","Gundala","Gudur","Dornipadu","Devarkadara","Kondapak","Dameracherla","Kamareddy","Gudur ","Hanumanthunipadu ","Malkajgiri","Laveru","Golugonda","Gurla","Govindaraopet","Iragavaram",15,"Nizamabad District ","Jammikunta",16,null,null,null,15,"Nizamabad District "]
[16,"Chennur","Gandlapenta","Kalakada  ","Jangareddigudem","Gurazala ",null,"Jammalamadugu • ","Julapalle","Julurpad","Ibrahimpatnam","Gadivemula","Dhanwada","Kondapur","Devarakonda","Kammar Palle","Indukurpet ","Inkollu ","Manchal ","Mandasa ","Gudem Kothaveedhi","Jami","Gudur","Jangareddigudem",16,"Nellore District","Julapalle",17,null,null,null,16,"Nellore District"]
[17,"Gudihathnur","Garladinne","Kalikiri  ","Jeelugumilli","Ipuru",null,"Kalasapadu ","Kamalapur","Kalluru ","Jaggayyapeta","Gonegandla","Dharur","Kowdipalle","Garide Palle","Kotgiri","Jaladanki ","Janakavaram Panguluru ","Marpalle","Meilaputti","Hukumpeta ","Jiyyamma Valasa","Hanamkonda","Jeelugumilli",17,"Prakasam District","Kamalapur",18,null,null,null,17,"Prakasam District"]
[18,"Jainoor","Gooty","Kambhamvaripalle ","Kalla ","Kakumanu",null,"Kamalapuram  ","Kamanpur","Karepalli","Kaikalur","Gospadu","Doulatabad","Kulcharam","Gundala","Lingampet","Kaligiri ","Kandukur ","Medchal ","Nandigam","K Kotapadu","Komarada","Hasanparthy","Kalla ",18,"Ranga reddy District ","Kamanpur",19,null,null,null,18,"Ranga reddy District "]
[19,"Kagaz Nagar","Gorantla","Karvetinagar ","Kamavarapukota","Karempudi",null,"Khajipet ","Karimnagar","Khammam Rural","Kalidindi ","Gudur ","Farooqnagar","Manoor","Gundla Palle","Machareddy","Kaluvoya ","Kanigiri ","Moinabad","Narasannapeta","Kasimkota","Kothavalasa","Jangaon","Kamavarapukota",19,"Sreekakulam District ","Karimnagar",20,null,null,null,19,"Sreekakulam District "]
[20,"Kotapalle","Gudibanda","Kuppam  ","Kovvur","Karlapalem",null,"Kodur  ","Kataram","Khammam Urban","Kanchika Cherla","Halaharvi","Gadwal","Medak ","Gurrampode","Madnur","Kavali ","Karamchedu ","Mominpet","Palakonda","Kotauratla","Kurupam","Kesamudram","Kovvur",20,"Visakhapatnam District","Kataram",21,null,null,null,20,"Visakhapatnam District"]
[21,"Laxmanchanda","Gummagatta","Kurabalakota  ","Koyyalagudem","Kollipara ",null,"Kondapuram  ","Kathlapur","Konijerla ","Kankipadu","Holagunda","Ghanpur","Mirdoddi","Huzurnagar","Makloor","Kodavalur ","Komarolu ","Nawabpet","Palasa","Koyyuru","Lakkavarapukota","Khanapur","Koyyalagudem",21,"Vizianagaram District","Kathlapur",22,null,null,null,21,"Vizianagaram District"]
[22,"Mancherial","Guntakal ","Mandanpalle  ","Lingapalem","Kollur ",null,"Lakkireddipalle • ","Kesavapatnam","Kothagudem","Koduru ","Jupadu Bungalow","Ghattu","Mulug","Jaji Reddi Gudem","Mortad","Kondapuram","Konakanamitla","Pargi","Pathapatnam","Madugula","Makkuva","Kodakandla","Lingapalem",22,"Warangal District ","Kesavapatnam",23,null,null,null,22,"Warangal District "]
[23,"Nennal","Hindupur ","Mulakalacheruvu ","Mogalthur","Krosuru ",null,"Lingala ","Kodimial ","Kukunoor ","Kruthivennu ","Kallur","Gopalpeta","Munpalle"," Kangal","Naga Reddipet","Kota","Kondapi","Peddemul","Polaki","Makavarapalem","Mentada ","Kothagudem ","Mogalthur",23,"West godavari District ","Kodimial ",24,null,null,null,23,"West godavari District "]
[24," Sarangapur","Kadiri ","Nagalapuram  ","Nallajerla","Machavaram ",null,"Muddanur  ","Koheda","Kunavaram","Machilipatnam","Kodumur","Hanwada","Nanganur","Kattangoor","Nandipet ","Kovur","Korisapadu ","Pudur","Ponduru","Munagapaka","Merakamudidam","Kuravi ","Nallajerla",24,null,"Koheda",25]
[25,"Tamsi","Kalyandurg","Nagari  ","Narasapuram","Macherla ",null,"Mylavaram ","Konaraopeta","Kusumanchi","Mandavalli","Koilkuntla","Itikyal ","Narayankhed","Kethepalle","Navipet ","Manubolu","Kothapatnam","Quthbullapur","Rajam","Munchingiputtu ","Nellimarla","Lingala Ghanpur","Narasapuram",25,null,"Konaraopeta",26]
[26,"Utnur","Kambadur","Narayanavanam  ","Nidadavole","Mangalagiri",null,"Mydukur  ","Koratla","Madhira","Mopidevi","Kolimigundla ","Jadcherla","Narsapur","Kodad ","Nizam Sagar","Marripadu","Kurichedu ","Rajendranagar ","Ranastalam","Nakkapalli","Pachipenta","Maddur","Nidadavole",26,null,"Koratla",27]
[27,"Bazarhathnoor","Kanaganapalle","Nimmanapalle  ","Nidamarru","Medikonduru ",null,"Nandalur  ","Mahadevpur","Manuguru ","Movva","Kosigi ","Kalwakurthy","Nyalkal","M Turkapalle","Nizamabad","Muthukur","Lingasamudram ","Saroornagar"," Regidiamadalavalasa ","Narsipatnam","Parvathipuram","Mahabubabad","Nidamarru",27,null,"Mahadevpur",28]
[28,"Bhainsa","Kanekal","Nindra  ","Palacole","Muppalla",null,"Obulavaripalle  ","Malharrao","Mudigonda","Mudinepalli","Kothapalle","Keshampeta ","Papannapet","Marri Guda ","Pitlam","Naidupeta","Maddipadu ","Serilingampalle","Santhabommali ","Nathavaram","Pusapatirega","Mangapet","Palacole",28,null,"Malharrao",29]
[29,"Dahegaon","Kothacheruvu","Pakala  ","Palakoderu","Nadendla ",null,"Peddamudium • ","Mallapur","Mulakalapalle","Musunuru","Kowthalam","Kodair","Patancheru","Mattampalle","Ranjal","Nellore","Markapur ","Shabad","Santhakaviti","Paderu","Ramabhadrapuram","Maripeda","Palakoderu",29,null,"Mallapur",30]
[30,"Ichoda","Kudair","Palamaner  ","Pedapadu","Nagaram ",null,"Penagaluru ","Mallial","Nelakondapalle","Mylavaram","Krishnagiri","Kodangal","Pulkal ","Mellachervu","Sadasivanagar","Ojili","Marripudi ","Shamirpet","Saravakota","Padmanabham","Salur","Mogullapalle","Pedapadu",30,null,"Mallial",31]
[31,"Jaipur","Kundurpi","Palasamudram ","Pedavegi","Nakarikallu ",null,"Pendlimarri ","Manakondur","Palawancha","Nagayalanka","Kurnool","Koilkonda","Raikode","Miryalaguda","Sirkonda","Pellakur","Martur ","Shamshabad","Sarubujjili","Paravada ","Seethanagaram"," Mulug","Pedavegi",31,null,"Manakondur",32]
[32,"Kasipet","Lepakshi","Pedda Panjani  ","Pentapadu","Narasaraopeta ",null,"Porumamilla  ","Manthani","Penuballi ","Nandigama","Maddikera East","Kollapur","Ramachandrapuram","Mothey","Tadwai ","Podlakur","Mundlamuru ","Shankarpalle","Seethampeta","Payakaraopeta ","Srungavarapukota","Nallabelly","Pentapadu",32,null,"Manthani",33]
[33,"Kouthala","Mudigubba","Peddamandyam  ","Penugonda","Nizampatnam ",null,"Proddutur  ","Medipalle","Pinapaka","Nandivada ","Mahanandi","Kondurg ","Ramayampet ","Mothkur","Varni","Rapur ","Naguluppalapadu","Tandur ","Sompeta","Pedabayalu","Therlam","Narmetta","Penugonda",33,null,"Medipalle",34]
[34," Lohesra","Nallacheruvu","Peddathippasamudram  ","Penumantra","Nuzendla ",null,"Pulivendla ","Metpalle","Sathupalle ","Nuzvid","Mantralayam","Kosgi","Regode","Munagala","Velpur","Sangam","Ongole ","Uppal","Srikakulam","Pedagantyada","Vepada","Narsampet","Penumantra",34,null,"Metpalle",35]
[35,"Mandamarri","Nallamada","Penumuru ","Peravali","Pedakakani ",null,"Pullampeta  ","Mustabad","Singareni","Pamarru","Midthur","Kothakota","Sadasivpet","Munugode","Yeda Palle","Seetharamapuram","Pamur ","Vikarabad","Tekkali","Pendurthi","Vizianagaram","Narsimhulapet","Peravali",35,null,"Mustabad",36]
[36,"Neradigonda","Nambulipulikunta"," Pichatur ","Poduru","Pedakurapadu ",null,"Railway Koduru • ","Mutharam Mahadevpur","Thallada","Pamidimukkala","Nandavaram","Kothur","Sangareddy ","Nadigudem","Yellareddy","Sullurpeta","Parchur ","Yacharam","Vajrapukothuru","Rambilli",null,"Nekkonda","Poduru",36,null,"Mutharam Mahadevpur",37]
[37,"Sirpur (T)","Narpala"," Pileru ","Polavaram ","Phirangipuram ",null,"Rajampet  ","Mutharam Manthani","Thirumalayapalem","Pedana","Nandi Kotkur","Lingal","Shankarampet (A)","Nakrekal",null,"Sydapuram ","Pedaaraveedu ","Yelal","Vangara","Ravikamatham",null,"Nellikudur","Polavaram ",37,null,"Mutharam Manthani",38]
[38,"Tandur","Obuladevaracheruvu","Pulicherla  ","T Narasapuram","Piduguralla ",null,"Raju Palem  ","Odela","Vararamachandrapuram","Pedaparupudi","Nandyal","Maddur","Shankarampet (R)","Nalgonda",null,"Tada ","Pedacherlopalle",null,"Veeraghattam","Rolugunta",null,"Palakurthi ","T Narasapuram",38,null,"Odela",39]
[39,"Vemanpalle","Pamidi","Punganur ","Tadepalligudem","Pittalavanipalem ",null,"Ramapuram  ","Peddapalle","Velairpad ","Penamaluru","Orvakal","Madgul","Shivampet","Nampalle",null,"Thotapalligudur ","Podili ",null,null,"S Rayavaram ",null,"Parkal","Tadepalligudem",39,null,"Peddapalle",40]
[40,"Bejjur","Parigi","Puthalapattu ","Tanuku","Ponnur ",null,"Rayachoti  ","Pegadapalle","Vemsoor","Penuganchiprolu","Owk","Maganoor","Siddipet ","Narayanapur",null,"Udayagiri ","Ponnaluru ",null,null,"Sabbavaram",null,"Parvathagiri","Tanuku",40,null,"Pegadapalle",41]
[41,"Bheemini","Peddapappur  ","Puttur  ","Thallapudi","Prathipadu ",null,"S Mydukur  ","Raikal","Venkatapuram","Reddigudem","Pagidyala","Mahbubnagar","Tekmal","Narketpalle",null,"Vakadu ","Pullalacheruvu ",null,null,"Visakhapatnam",null,"Raghunatha Palle  ","Thallapudi",41,null,"Raikal",42]
[42,"Dandepalle","Peddavadugur","Rama Kuppam  ","Undi","Rajupalem ",null,"Sambepalle ","Ramadugu","Wazeed","Thotlavalluru","Pamulapadu","Makthal","Tupran","Nered Cherla",null,"Varikuntapadu ","Racherla ",null,null,"Visakhapatnam(U)",null,"Raiparthy ","Undi",42,null,"Ramadugu",43]
[43,"Inderavelly","Penu Konda","Ramachandrapuram ","Undrajavaram","Rentacrintala ",null,"Sidhout  ","Ramagundam","Wyra","Tiruvuru","Panyam","Maldakal","Wargal","Nidamanur",null,"Venkatachalam ","Santhamaguluru ",null,null,"Yelamanchili",null,"Regonda","Undrajavaram",43,null,"Ramagundam",44]
[44,"Jannaram","Putlur","Ramasamudram  ","Unguturu","Repalle ",null,"Simhadripuram • ","Saidapur","Yellandu","Unguturu","Pattikanda","Manopadu","Yeldurthy","Nuthankal",null,"Venkatagiri ","Santhanuthlapadu ",null,null,null,null,"Sangem","Unguturu",44,null,"Saidapur",45]
[45,"Kerameri","Puttaparthi","Renigunta  ","Veeravasaram","Rompicherla",null,"T Sundupalle  ","Sarangapur","Yerrupalem","Vatsavai ","Peapally","Midjil","Zahirabad","Pedda Adiserlapalle",null,"Vidavalur ","Singarayakonda ",null,null,null,null,"Shayampet","Veeravasaram",45,null,"Sarangapur",46]
[46,"Kubeer","Ramagiri ","Rompicherla  ","Yelamanchili","Sattenapalle",null,"Thandur ","Sirsilla",null,"Veerullapadu","Pedda Kadubur","Nagar Kurnool",null,"Peddavura",null,"Vinjamur","Tangutur ",null,null,null,null,"Tadvai ","Yelamanchili",46,null,"Sirsilla",47]
[47,"Luxettipet","Raptadu","Santhi Puram  ",null,"Savalyapuram",null,"Vallur ","Srirampur",null,"Vijayawada Rural","Rudravaram","Narayanpet",null,"Penpahad",null,null,"Tarlapadu ",null,null,null,null,"Thorrur",null,47,null,"Srirampur",48]
[48,"Mudhole","Roddam","Satyavedu  ",null,"Tadikonda",null,"Veeraballe ","Sultanabad",null,"Vijayawada Urban","Sanjamala ","Narva",null,"Pochampalle",null,null,"Thallur ",null,null,null,null,"Venkatapur",null,48,null,"Sultanabad",49]
[49,"Nirmal","Rolla","Sodam  ",null,"Tenali ",null,"Veerapunayunipalle •","Thimmapur",null,"Vissannapet","Sirvel","Nawabpet",null,"Rajapet",null,null,"Tripuranthakam ",null,null,null,null,"Wardhannapet",null,49,null,"Thimmapur",50]
[50,"Sirpur (U)","Settur","Somala  ",null,"Thadepalle",null,"Vempalle  ","Veenavanka ",null,"Vuyyuru","Srisailam","Pangal",null,"Ramannapeta ",null,null,"Ulavapadu ",null,null,null,null,"Zaffergadh",null,50,null,"Veenavanka ",51]
[51,"Tanur","Singanamala","Srikalahasti ",null,"Thullur",null,"Vemula ","Velgatoor",null,null,"Tuggali","Pebbair",null,"Saligouraram",null,null,"Veligandla ",null,null,null,null,null,null,51,null,"Velgatoor",52]
[52,"Wankdi","Somandepalle","Srirangarajapuram  ",null,"Tsundur",null,"Vontimitta ","Vemulawada",null,null,"Uyyalawada","Peddakothapalle",null,"Suryapet",null,null,"Vetapalem ",null,null,null,null,null,null,52,null,"Vemulawada",53]
[53,null,"Tadimarri ","Thamballapalle ",null,"Vatticherukuru",null,"Yerraguntla","Yella Reddi Peta",null,null,"Veldurthi","Peddamandadi",null,"Thipparthi",null,null,"Voletivaripalem ",null,null,null,null,null,null,53,null,"Yella Reddi Peta",54]
[54,null,"Tadpatri ","Thavanampalle ",null,"Veldurthi ",null,null,null,null,null,"Velgodu","Tadoor",null,"Thirumalagiri",null,null,"Yeddanapudi ",null,null,null,null,null,null,54,null,0,55]
[55,null,"Talupula","Thottambedu ",null,"Vemuru",null,null,null,null,null,"Yemmiganur","Talakondapalle",null,"Thripuraram",null,null,"Yerragondapalem ",null,null,null,null,null,null,55,null,0,56]
[56,null,"Tanakal","Tirupati Rural ",null,"Vinukonda",null,null,null,null,null,null,"Telkapalle",null,"Thunga Thurthi",null,null,"Zarugumilli",null,null,null,null,null,null,56,null,0,57]
[57,null,"Uravakonda","Tirupati Urban ",null,null,null,null,null,null,null,null,"Thimmajipeta",null,"Valigonda",null,null,null,null,null,null,null,null,null,57,null,0,58]
[58,null,"Vajrakarur","Vadamalapeta  ",null,null,null,null,null,null,null,null,"Uppununthala",null,"Vemulapalle",null,null,null,null,null,null,null,null,null,58,null,0,59]
[59,null,"Vidapanakal","Varadaiahpalem  ",null,null,null,null,null,null,null,null,"Utkoor",null,"Yadagirigutta",null,null,null,null,null,null,null,null,null,59,null,0,60]
[60,null,"Yadiki","Vayalpad  ",null,null,null,null,null,null,null,null,"Vangoor",null,null,null,null,null,null,null,null,null,null,null,60,null,0,61]
[61,null,"Yellanur","Veduru Kuppam  ",null,null,null,null,null,null,null,null,"Veepangandla",null,null,null,null,null,null,null,null,null,null,null,61,null,0,62]
[62,null,null,"Venkatagiri Kota  ",null,null,null,null,null,null,null,null,"Veldanda",null,null,null,null,null,null,null,null,null,null,null,62,null,0,63]
[63,null,null,"Vijaya Puram  ",null,null,null,null,null,null,null,null,"Waddepalle",null,null,null,null,null,null,null,null,null,null,null,63,null,0,64]
[64,null,null,"Yadamari ",null,null,null,null,null,null,null,null,"Wanaparthy",null,null,null,null,null,null,null,null,null,null,null,64,null,0,65]
[65,null,null,"Yerpedu ",null,null,null,null,null,null,null,null,null,null,null,null,null,null,null,null,null,null,null,null,65,null,{"$f":" HLOOKUP($Z$1,$B$2:$X$68,AB67,FALSE)","v":0},66]
[66,null,null,"Yerravaripalem",null,null,null,null,null,null,null,null,null,null,null,null,null,null,null,null,null,null,null,null,66,null,{"$f":" HLOOKUP($Z$1,$B$2:$X$68,AB68,FALSE)","v":0},67]
[]
[]
[]
[]
[]
[]
[]
[]
[]
[]
[]
[]
[]
[]
[]
[]
[]
[null,null,null,null,null,null,null,null,null,null,null,null,null,null,null,null,null,{"$f":"R88&\"-\"&S88&\"-\"&T87","v":"17-7-2010"},null,null,null,null,{"$f":"W88&\"-\"&X88&\"-\"&Y87","v":"21-6-2011"},null,null,null,null,{"$f":"AB88&\"-\"&AC88&\"-\"&AD87","v":"24-11-2011"}]
[null,null,null,null,null,null,null,null,null,null,null,null,null,null,null,null,null,null,{"$f":"LOOKUP(S88,R89:S100,S89:S100)","v":"Jul"},{"$f":"LOOKUP(T88,R89:T100,T89:T100)","v":2010},null,null,null,{"$f":"LOOKUP(X88,W89:X100,X89:X100)","v":"Jun"},{"$f":"LOOKUP(Y88,W89:Y100,Y89:Y100)","v":2011},null,null,null,{"$f":"LOOKUP(AC88,AB89:AC100,AC89:AC100)","v":"Nov"},{"$f":"LOOKUP(AD88,AB89:AD100,AD89:AD100)","v":2011},{"$f":"VLOOKUP(AE88,AB89:AE94,4)","v":"first"}]
[null,null,null,null,null,null,null,null,null,null,null,null,null,null,null,null,null,17,7,1,null,null,21,6,2,null,null,24,11,2,1]
[null,null,null,null,null,null,null,null,null,null,null,null,null,null,null,null,null,1,"Jan",2010,null,null,1,"Jan",2010,null,null,1,"Jan",2010,"first"]
[null,null,null,null,null,null,null,null,null,null,null,null,null,null,null,null,null,2,"Feb",2011,null,null,2,"Feb",2011,null,null,2,"Feb",2011,"second"]
[null,null,null,null,null,null,null,null,null,null,null,null,null,null,null,null,null,3,"Mar",2012,null,null,3,"Mar",2012,null,null,3,"Mar",2012,"third"]
[null,null,null,null,null,null,null,null,null,null,null,null,null,null,null,null,null,4,"Apr",2013,null,null,4,"Apr",2013,null,null,4,"Apr",2013,"fourth"]
[null,null,null,null,null,null,null,null,null,null,null,null,null,null,null,null,null,5,"May",null,null,null,5,"May",null,null,null,5,"May",null,"fifth"]
[null,null,null,null,null,null,null,null,null,null,null,null,null,null,null,null,null,6,"Jun",null,null,null,6,"Jun",null,null,null,6,"Jun",null,"sixth"]
[null,null,null,null,null,null,null,null,null,null,null,null,null,null,null,null,null,7,"Jul",null,null,null,7,"Jul",null,null,null,7,"Jul"]
[null,null,null,null,null,null,null,null,null,null,null,null,null,null,null,null,null,8,"Aug",null,null,null,8,"Aug",null,null,null,8,"Aug"]
[null,null,null,null,null,null,null,null,null,null,null,null,null,null,null,null,null,9,"Sep",null,null,null,9,"Sep",null,null,null,9,"Sep"]
[null,null,null,null,null,null,null,null,null,null,null,null,null,null,null,null,null,10,"Oct",null,null,null,10,"Oct",null,null,null,10,"Oct"]
[null,null,null,null,null,null,null,null,null,null,null,null,null,null,null,null,null,11,"Nov",null,null,null,11,"Nov",null,null,null,11,"Nov"]
[null,null,null,null,null,null,null,null,null,null,null,null,null,null,null,null,null,12,"Dec",null,null,null,12,"Dec",null,null,null,12,"Dec"]
[null,null,null,null,null,null,null,null,null,null,null,null,null,null,null,null,null,13,null,null,null,null,13,null,null,null,null,13]
[null,null,null,null,null,null,null,null,null,null,null,null,null,null,null,null,null,14,null,null,null,null,14,null,null,null,null,14]
[null,null,null,null,null,null,null,null,null,null,null,null,null,null,null,null,null,15,null,null,null,null,15,null,null,null,null,15]
[null,null,null,null,null,null,null,null,null,null,null,null,null,null,null,null,null,16,null,null,null,null,16,null,null,null,null,16]
[null,null,null,null,null,null,null,null,null,null,null,null,null,null,null,null,null,17,null,null,null,null,17,null,null,null,null,17]
[null,null,null,null,null,null,null,null,null,null,null,null,null,null,null,null,null,18,null,null,null,null,18,null,null,null,null,18]
[null,null,null,null,null,null,null,null,null,null,null,null,null,null,null,null,null,19,null,null,null,null,19,null,null,null,null,19]
[null,null,null,null,null,null,null,null,null,null,null,null,null,null,null,null,null,20,null,null,null,null,20,null,null,null,null,20]
[null,null,null,null,null,null,null,null,null,null,null,null,null,null,null,null,null,21,null,null,null,null,21,null,null,null,null,21]
[null,null,null,null,null,null,null,null,null,null,null,null,null,null,null,null,null,22,null,null,null,null,22,null,null,null,null,22]
[null,null,null,null,null,null,null,null,null,null,null,null,null,null,null,null,null,23,null,null,null,null,23,null,null,null,null,23]
[null,null,null,null,null,null,null,null,null,null,null,null,null,null,null,null,null,24,null,null,null,null,24,null,null,null,null,24]
[null,null,null,null,null,null,null,null,null,null,null,null,null,null,null,null,null,25,null,null,null,null,25,null,null,null,null,25]
[null,null,null,null,null,null,null,null,null,null,null,null,null,null,null,null,null,26,null,null,null,null,26,null,null,null,null,26]
[null,null,null,null,null,null,null,null,null,null,null,null,null,null,null,null,null,27,null,null,null,null,27,null,null,null,null,27]
[null,null,null,null,null,null,null,null,null,null,null,null,null,null,null,null,null,28,null,null,null,null,28,null,null,null,null,28]
[null,null,null,null,null,null,null,null,null,null,null,null,null,null,null,null,null,29,null,null,null,null,29,null,null,null,null,29]
[null,null,null,null,null,null,null,null,null,null,null,null,null,null,null,null,null,30,null,null,null,null,30,null,null,null,null,30]
[null,null,null,null,null,null,null,null,null,null,null,null,null,null,null,null,null,31,null,null,null,null,31,null,null,null,null,31]

{"sheet":"Form c","index":10,"n_rows":56,"n_cols":9,"rows_kept":56,"cut":false,"hidden":false,"merged":[[5,2,5,6],[1,1,1,10],[2,1,2,10],[3,1,3,10],[55,4,55,9],[19,8,19,10],[29,8,31,10],[21,8,23,10],[25,8,28,10],[32,8,34,10],[50,1,50,10],[52,2,52,10]]}
[]
[null,"FROM “C”"]
[null,"(Vide Rule 15 (3)"]
[null,"APPLICATION FOR CLAIMING REFND OF MEDICAL  EXPENSES"]
[null,"1.       ","Name and designation of the Government Servant ",null,null,null,null,":",{"$f":"UPPER(MAIN!$I$6)","v":"G.SAIVIJAYA KUMAR"}]
[null,null,"(In Block letters)",null,null,null,null,null,{"$f":"Code!R31","v":"School Assistant (Phy. Edn.)"}]
[null," "]
[null,"2.       ","Office in which employed      ",null,null,null,null,":",{"$f":"Code!R32","v":"ZPP. High School, Balayapalli"}]
[null,null,null,null,null,null,null,null,{"$f":"Code!R33","v":"Jammikunta"}]
[null,null,null,null,null,null,null,null,{"$f":"Code!R34","v":"Kareemnagar District "}]
[]
[null,"3.       ","Salary",null,null,null,null,":",{"$f":"Salary!D26","v":"Rs.12298"}]
[]
[null,"4.       ","Place of duty",null,null,null,null,":",{"$f":"I8","v":"ZPP. High School, Balayapalli"}]
[]
[null,"5.       ","Full residential address",null,null,null,null,":",{"$f":"\"H.No:\"&MAIN!$G$13","v":"H.No:7-197,PS street"}]
[null,null,null,null,null,null,null,null,{"$f":"MAIN!$G$14","v":"Venkatagiri"}]
[null,null,null,null,null,null,null,null,{"$f":"Mandals3!AD2","v":"Gannavaram"}]
[null,null,null,null,null,null,null,null,{"$f":"Mandals3!Z1","v":"Krishan District "}]
[null,"6.       ","Name of the patient and his Relationship to the Govt servant",null,null,null,null,":",{"$f":"Code!F65&PROPER(MAIN!$R$6)&\",\"&PROPER(Code!B55)","v":"Smt.G.Padmavathamma,Self"}]
[]
[null,"7.       ","Place at which the patient Fell ill",null,null,null,null,":",{"$f":"Code!O1","v":"Venkatapadma Hospitals, 15-1-45, Three\nLamps Junction, Beside Masjid, Vizianagaram"}]
[]
[]
[]
[null,"8.       ","Nature of  illness and its duration",null,null,null,null,":",{"$f":"MAIN!$Q$9&\".,\"&\"from \"&Mandals1!R86&\" to \"&Mandals1!W86&\".\"","v":"Undrewent Phacoemulsification with IOL implementation left eye and cataract left eye.,from 17-7-2010 to 21-6-2011."}]
[]
[]
[]
[null,"9.       ","Details of amount claimed.",null,null,null,null,":",{"$f":"'aPP ii'!E26&\"  \"&'aPP ii'!E27&\"  \"&'aPP ii'!E28","v":"List of Medicines in detailed   and  Essentiality Certificates are enclosed"}]
[]
[]
[null,"10.   ","Total amount claimed.",null,null,null,null,":",{"$f":"'aPP ii'!E29&'aPP ii'!F29&\" \"&'aPP ii'!E30","v":"Rs.2000-00 (Rupees   Two Thousand   and  Zero Only) "}]
[]
[]
[]
[null,"11.   ","List of enclosures",null,null,null,null,":",{"$f":"'aPP ii'!F31","v":"Requisition letter to HM."}]
[null,null,null,null,null,null,null,null,{"$f":"'aPP ii'!F32","v":"Requisition letter from HM to DEO."}]
[null,null,null,null,null,null,null,null,{"$f":"'aPP ii'!F33","v":"Salary certifcate"}]
[null,null,null,null,null,null,null,null,{"$f":"'aPP ii'!F34","v":"Appendix II"}]
[null,null,null,null,null,null,null,null,{"$f":"'aPP ii'!F35","v":"Form -C"}]
[null,null,null,null,null,null,null,null,{"$f":"'aPP ii'!F36","v":"Check List"}]
[null,null,null,null,null,null,null,null,{"$f":"'aPP ii'!F37","v":"Essentiality Certificate"}]
[null,null,null,null,null,null,null,null,{"$f":"'aPP ii'!F38","v":"Dependent Certificate"}]
[null,null,null,null,null,null,null,null,{"$f":"'aPP ii'!F39","v":"Availment certificate"}]
[null,null,null,null,null,null,null,null,{"$f":"'aPP ii'!F40","v":"Non-Drawl Certificate"}]
[null,null,null,null,null,null,null,null,{"$f":"'aPP ii'!F41","v":"Discharge summary"}]
[null,null,null,null,null,null,null,null,{"$f":"'aPP ii'!F42","v":"Medical Bills"}]
[]
[]
[null,"DICLARATION TO BE SIGNED BY THE GOVERNMENT SERVANT"]
[]
[null,"   ","                            I hereby declare that the Statement in this application is true to the best of my knowledge and belief and that the person for whom medical expenses were incurred is a pensioner of the A.P State Government."]
[]
[]
[null,null,null,null,"Signature of the Govt servant"]

{"sheet":"Check Slip","index":11,"n_rows":24,"n_cols":7,"rows_kept":24,"cut":false,"hidden":false,"merged":[[1,11,1,12],[12,4,12,10],[19,4,19,10],[20,4,20,5],[1,1,1,10],[2,4,2,10],[3,4,3,10],[4,4,4,10],[5,4,5,10],[6,4,6,10],[23,6,23,10],[2,1,6,1],[2,2,6,2],[2,3,6,3],[9,1,11,1],[9,2,11,2],[9,4,11,10],[8,4,8,10],[7,4,7,10]]}
[]
[null,"CHECK SLIP FOR SENDING MEDICAL REIMBURSEMENT PROPOSALS"]
[null,1,"Name and Official Address of the Employee",null,{"$f":"IF(Code!Q3=\"\",\"\",UPPER(Code!R30))","v":"SRI. G.SAIVIJAYA KUMAR"}]
[null,null,null,null,{"$f":"Code!R31","v":"School Assistant (Phy. Edn.)"}]
[null,null,null,null,{"$f":"Code!R32","v":"ZPP. High School, Balayapalli"}]
[null,null,null,null,{"$f":"Code!R33","v":"Jammikunta"}]
[null,null,null,null,{"$f":"Code!R34","v":"Kareemnagar District "}]
[null,2,"Name of the Patient and relationship",null,{"$f":"'Form c'!I20","v":"Smt.G.Padmavathamma,Self"}]
[null,3,"Dates of Treatment",null,{"$f":"\"from \"&Mandals1!R86&\" to \"&Mandals1!W86&\".\"","v":"from 17-7-2010 to 21-6-2011."}]
[null,4,"Name and Address of Hospital",null,{"$f":"IF(Code!T8=\"\",\"\",UPPER(Code!O1))","v":"VENKATAPADMA HOSPITALS, 15-1-45, THREE\nLAMPS JUNCTION, BESIDE MASJID, VIZIANAGARAM"}]
[]
[]
[null,5,"Whether Private or Government?",null,{"$f":"UPPER(Code!D73)","v":"GOVERNMENT"}]
[null,6,"Whether the proposal is received in the Head Office within a period of six months from the date of discharge?",null,{"$f":"CONCATENATE(\"YES\",\" /\")","v":"YES /"},"NO"]
[null,7,"Whether Appendix – II attested by the Head of the Office is enclosed?",null,"YES /","NO"]
[null,8,"In case of Treatment at Recognized Hospital / NIMS / SVIMS whether Emergency Certificate enclosed?",null,"YES /","NO"]
[null,9,"Whether Essentiality Certificate mentioning the amount of expenditure for the Treatment signed by the Doctor who treated and attested by the Authorized Medical Agency is enclosed?",null,"YES /","NO"]
[null,10,"Whether the bills for the amount mentioned in the Essentiality Certificate attested by the Doctor who treated /A.M.A. are enclosed?",null,"YES /","NO"]
[null,11,"Whether the Discharge Summary of the Patient enclosed?",null,"YES /","NO"]
[null,12,"In case of retired teachers whether the copy of the Pension Payment Order is enclosed?",null,"Not Applicable"]
[null,13,"In case of dependents above the age of 18 years, unemployment and Dependency Certificate counter signed by the Head of the Office is enclosed?",null,{"$f":"IF(MAIN!W8<=18,\"Not Applicable\",\"YES\")","v":"Not Applicable"}]
[]
[]
[null,null,"   Signature of the\nGovernment Servant",null,null,null,"Signature of the\nHead of the Office"]

{"sheet":"Salary","index":12,"n_rows":39,"n_cols":31,"rows_kept":39,"cut":false,"hidden":false,"merged":[[25,3,25,4],[17,11,17,12],[18,11,18,12],[17,8,17,9],[18,8,18,9],[17,3,17,4],[18,3,18,4],[16,14,16,16],[17,14,17,16],[18,14,18,16],[13,11,13,12],[14,11,14,12],[15,11,15,12],[16,11,16,12],[19,14,19,16],[20,8,20,9],[23,3,23,4],[24,3,24,4],[12,8,12,9],[13,8,13,9],[14,8,14,9],[15,8,15,9],[16,8,16,9],[12,3,12,4],[13,3,13,4],[14,3,14,4],[15,3,15,4],[16,3,16,4],[14,14,14,16],[15,14,15,16],[35,5,35,6],[36,5,36,6],[38,1,38,9],[27,1,27,9],[30,3,30,4],[29,3,29,4],[11,3,11,4],[11,8,11,9],[13,19,13,20],[11,13,11,14],[10,13,10,14],[11,15,11,17],[10,15,10,17],[12,14,12,16],[13,14,13,16],[5,12,7,15],[1,1,1,9],[3,1,8,9],[10,1,10,4],[10,6,10,9]]}
[]
[]
[]
[null,{"$f":"CONCATENATE(\"                                 This is certify that \",Code!R30, \" \",Code!P57,\" \",N12,\" \",\" working in this office \",'Form c'!I14,\" as \",'Form c'!I6,\" and \",Code!X13,\" salary particulars are as follows for the month of \",UPPER(Mandals1!AC87), \" 2010.\")","v":"                                 This is certify that Sri. G.Saivijaya Kumar S/o G.Srinivasrao  working in this office ZPP. High School, Balayapalli as School Assistant (Phy. Edn.) and his salary particulars are as follows for the month of NOV 2010."}]
[]
[null,null,null,null,null,null,null,null,null,null,null,null,"Enter your salary details in green color cells"]
[]
[]
[]
[]
[null,"Pay",null,null,null,null,"Deductions",null,null,null,null,"Employee Name",null,{"$f":"MAIN!$I$6","v":"G.Saivijaya Kumar"}]
[null,"Pay","::",{"$f":"IF(N13=0,0,\"Rs.\"&N13)","v":"Rs.15700"},null,null,{"$f":"Code!G49","v":"ZPPF"},"::",{"$f":"IF(R13=0,0,\"Rs.\"&R13)","v":"Rs.2500"},null,null,null,null,"G.Srinivasrao",null,"Deductions"]
[null,"DA","::","Rs.2365",null,null,{"$f":"Code!G53","v":"ZPPF Loan"},"::","Rs.1000",null,null,"Basic Pay",null,{"$f":"Code!J136","v":15700},"GPF/ZPPF/CPS",null,null,2500]
[null,"HRA","::",{"$f":"IF(N15=0,0,\"Rs.\"&N15)","v":"Rs.1570"},null,null,"Festival Advance","::","Rs.200",null,null,"DA",null,2365,"GPF/ZPPF/CPS LOAN",null,null,1000,null,{"$f":"D31","v":"24-11-2011"},null,{"$f":"MONTH(T14)","v":11},null,{"$f":"LOOKUP(V14,T20:AE20,T21:AE21)","v":"NOVEMBER"},{"$f":"YEAR(T14)","v":2011}]
[null,"FPI","::","Rs.75",null,null,"GIS","::","Rs.60",null,null,"HRA",null,1570,"Festival Advance",null,null,200]
[null,"AI/PP","::","Rs.100",null,null,"APGLI","::","Rs.600",null,null,"FPI",null,75,"GIS",null,null,60]
[null,"others","::","Rs.60",null,null,"LIC","::","Rs.3012",null,null,"AI/PP",null,100,"APGLI",null,null,600]
[null,null,null,0,null,null,"P. Tax","::","Rs.200",null,null,"Others",null,60,"LIC",null,null,3012]
[null,"Total","::",{"$f":"\"Rs.\"&N13+N14+N15+N16+N17+N18","v":"Rs.19870"},null,null,"others","::",0,null,null,null,null,null,"P.Tax",null,null,200]
[null,null,null,null,null,null,null,null,null,null,null,null,null,null,"Others",null,null,null,null,1,2,3,4,5,6,7,8,9,10,11,12]
[null,null,null,null,null,null,"Total","::",{"$f":"\"Rs.\"&R13+R14+R15+R16+R17+R18+R19+R20","v":"Rs.7572"},null,null,null,null,null,null,null,null,null,null,"JANUARY","FEBRUARY","MARCH","APRIL","MAY","JUNE","JULY","AUGUST","SEPTEMBER","OCTOBER","NOVEMBER","DECEMBER"]
[]
[]
[null,"Salary","::",{"$f":"D19","v":"Rs.19870"}]
[null,"Deductions","::",{"$f":"I21","v":"Rs.7572"}]
[null,"Net Total","::",{"$f":"\"Rs.\"&N13+N14+N15+N16+N17+N18+N19-R13-R14-R15-R16-R17-R18-R19-R20","v":"Rs.12298"}]
[null,null,null,null,null,null,null,null,null,null,null,null,null,null,null,null,null,null,null,"JANUARY","FEBRUARY","MARCH","APRIL","MAY","JUNE","JULY","AUGUST","SEPTEMBER","OCTOBER","NOVEMBER","DECEMBER"]
[null,{"$f":"Rs!B100","v":"(Rupees  Twelve  Thousand  Two Hundred  and  Ninety Eighty Only) "}]
[null,null,null,null,null,null,null,null,null,null,null,null,null,null,null,null,null,null,null,31,28,31,30,31,30,31,31,30,31,30,31]
[null,"Place","::",{"$f":"[1]Data!E9","v":"ZPPHS,Balayapalli"}]
[null,"Date","::",{"$f":"Mandals1!AB86","v":"24-11-2011"}]
[]
[null,null,null,null,null,null,null,null,null,null,null,null,null,null,null,null,null,null,null,{"$f":"LOOKUP(X14,T27:AE27,T29:AE29)","v":31}]
[]
[]
[null,null,null,null,null,"Signature"]
[null,null,null,null,null,"Designation"]
[]
[null,"Prepared by:G.Bhasker reddy,STU,Balayapalli Unit"]

{"sheet":"aPP ii","index":13,"n_rows":48,"n_cols":7,"rows_kept":48,"cut":false,"hidden":false,"merged":[[1,12,2,13],[30,2,42,2],[30,5,30,11],[31,5,31,11],[32,5,32,11],[39,5,39,11],[25,4,25,11],[27,4,27,11],[13,4,13,11],[14,4,14,11],[15,4,15,11],[24,4,24,11],[1,1,1,11],[25,1,27,1],[26,4,26,7],[25,2,27,2],[44,1,44,11],[47,6,47,11],[29,4,29,11],[28,5,28,11],[42,5,42,11],[38,5,38,11],[30,1,42,1],[34,5,34,10],[41,5,41,10],[33,5,33,9],[35,5,35,9],[36,5,36,11],[37,5,37,11],[40,5,40,10],[28,1,29,1],[28,2,29,2],[2,1,2,11],[9,4,9,11],[3,2,4,2],[9,1,11,1],[3,1,4,1],[3,4,3,11],[4,4,4,11],[8,4,8,11],[5,4,5,11],[6,4,6,11],[7,4,7,11],[21,1,24,1],[21,2,24,2],[21,4,23,11],[16,4,16,11],[18,4,20,11],[18,1,20,1],[18,2,20,2],[17,4,17,11],[16,1,17,1],[16,2,17,2],[12,4,12,11],[10,4,10,11],[11,4,11,11],[5,1,7,1],[5,2,7,2],[12,1,15,1],[12,2,15,2],[9,2,11,2]]}
[]
[null,"APPENDIX – II"]
[null,"APPLICATION FOR CLAIMING REFUND OF MEDICAL EXPENSES INCURRED IN CONNECTION WITH MEDICAL ATTENDANCE AND TREATMENT OF GOVERNMENT SERVANT AND THEIR FAMILIES"]
[null,1,"Name, Designation & Section of Government Servant (in block letters)",null,{"$f":"'Check Slip'!E3","v":"SRI. G.SAIVIJAYA KUMAR"}]
[null,null,null,null,{"$f":"'Form c'!I6","v":"School Assistant (Phy. Edn.)"}]
[null,2,"Office in which Employed",null,{"$f":"'Form c'!I8","v":"ZPP. High School, Balayapalli"}]
[null,null,null,null,{"$f":"'Form c'!I9","v":"Jammikunta"}]
[null,null,null,null,{"$f":"'Form c'!I10","v":"Kareemnagar District "}]
[null,3,"Pay of the Government Servant as defined in F.Rs. and other employments which should be shown separately",null,{"$f":"Code!F55&\" / \"&Code!J136","v":"12910-36700 / 15700"}]
[null,4,"Place of Duty",null,{"$f":"IF(Code!S3=\"\",\"\",CONCATENATE(Code!S3,\",\"))","v":"ZPP. High School, Balayapalli,"}]
[null,null,null,null,{"$f":"IF(Code!T3=\"\",\"\",CONCATENATE(Code!T3,\",\"))","v":"Balayapalli Mandal,"}]
[null,null,null,null,{"$f":"IF(Code!U3=\"\",\"\",CONCATENATE(Code!U3,\".\"))","v":"Medak District."}]
[null,5,"Full Residential Address with door number, name of the Mohalla and District",null,{"$f":"'Form c'!I16","v":"H.No:7-197,PS street"}]
[null,null,null,null,{"$f":"'Form c'!I17","v":"Venkatagiri"}]
[null,null,null,null,{"$f":"'Form c'!I18","v":"Gannavaram"}]
[null,null,null,null,{"$f":"'Form c'!I19","v":"Krishan District "}]
[null,6,"Name of the Patient, his/her relationship to the Government Servant, in case of children state age also",null,{"$f":"'Check Slip'!E8:K8","v":"Smt.G.Padmavathamma,Self"}]
[null,null,null,null,{"$f":"IF(Code!S8=\"\",\"\",CONCATENATE(\"Aged\",\"  \",Code!B124,\" years\"))","v":"Aged  96 years"}]
[null,7,"Place at which the patient fell ill",null,{"$f":"'Form c'!I22","v":"Venkatapadma Hospitals, 15-1-45, Three\nLamps Junction, Beside Masjid, Vizianagaram"}]
[]
[]
[null,8,"Nature of illness and its duration",null,{"$f":"IF(Code!U8=\"\",\"\",UPPER(Code!U8))","v":"UNDREWENT PHACOEMULSIFICATION WITH IOL IMPLEMENTATION LEFT EYE AND CATARACT LEFT EYE"}]
[]
[]
[null,null,null,null,{"$f":"'Check Slip'!E9","v":"from 17-7-2010 to 21-6-2011."}]
[null,9,"Details of amount claimed, cost of Medicines purchased from the market/ list of Medicines purchased with cash memos, and the Essentiality Certificate should be attached each in duplicate signed",null,"List of Medicines in detailed "]
[null,null,null,null,"and"]
[null,null,null,null,"Essentiality Certificates are enclosed"]
[null,10,"Total amount claimed",null,null,{"$f":"IF(Code!V8=\"\",\"\",CONCATENATE(\"Rs.\",Code!V8,\"-00\"))","v":"Rs.2000-00"}]
[null,null,null,null,{"$f":"IF(Code!W8=\"\",\"\",Code!W8)","v":"(Rupees   Two Thousand   and  Zero Only) "}]
[null,11,"List of Enclosures",null,null,"Requisition letter to HM."]
[null,null,null,null,null,"Requisition letter from HM to DEO."]
[null,null,null,null,null,"Salary certifcate"]
[null,null,null,null,null,"Appendix II"]
[null,null,null,null,null,"Form -C"]
[null,null,null,null,null,"Check List"]
[null,null,null,null,null,"Essentiality Certificate"]
[null,null,null,null,null,"Dependent Certificate"]
[null,null,null,null,null,"Availment certificate"]
[null,null,null,null,null,"Non-Drawl Certificate"]
[null,null,null,null,null,"Discharge summary"]
[null,null,null,null,null,"Medical Bills"]
[]
[]
[null,"              I here by declare that, the statements in this application are true to the best of my knowledge and belief and that the person for whom Medical Expenses were incurred is a member of my family as defined under the Govt. Servant Medical Attendance Rules and wholly dependent upon me."]
[]
[]
[null,null,"Signature of the \nGovernment Servant",null,null,null,"Signature of the\nHead of the Office"]

{"sheet":"PROFORMA","index":14,"n_rows":4,"n_cols":11,"rows_kept":4,"cut":false,"hidden":false,"merged":[[1,1,1,10]]}
[]
[null,"PROFORMA"]
[null,"S.No","Name &\nDesignation","Place of \nWork","Disease Name","Period","Amount","Spell","Entered in SR","Entered in reimbursement\nRegister","Sign of Authority"]
[null,1,{"$f":"Code!R30&\",\"&Code!R31","v":"Sri. G.Saivijaya Kumar,School Assistant (Phy. Edn.)"},{"$f":"MAIN!G8","v":"ZPP. High School, Balayapalli"},{"$f":"MAIN!Q9","v":"Undrewent Phacoemulsification with IOL implementation left eye and cataract left eye"},{"$f":"'Check Slip'!E9","v":"from 17-7-2010 to 21-6-2011."},{"$f":"CONCATENATE(\"Rs.\",MAIN!Q10)","v":"Rs.2000"},{"$f":"Mandals1!AE87","v":"first"},"Yes","Yes"]

{"sheet":"Dependent","index":15,"n_rows":20,"n_cols":8,"rows_kept":20,"cut":false,"hidden":false,"merged":[[19,2,19,5],[19,7,19,10],[1,11,1,12],[1,2,1,10],[2,2,2,10],[5,2,15,10]]}
[]
[null,null,"DEPENDENT CERTIFICATE GIVEN BY THE GOVERNMENT SERVANT"]
[null,null,"(As per instructions issued in C & DSE, A.P., Hyderabad Procs. Rc.No. 8878/D3-4/2009, dated: 02-09-2009)"]
[]
[]
[null,null,{"$f":"IF(Code!B55=\"self\",\"                I, \"&Code!R30&\", \"&Code!R31&\",\"&Code!R32&\",\"&Code!R33&\", \"&Code!R34&\",do hereby declare that \"&'aPP ii'!E17&\" \"&'aPP ii'!E18&\" and has no property of income of \"&Code!H97&\" own and that,\"&Code!H82&\"  is wholly dependent on me only.\",\"           I, \"&Code!R30&\", \"&Code!R31&\",\"&Code!R32&\",\"&Code!R33&\", \"&Code!R34&\",do hereby declare that \"&'aPP ii'!E17&\" \"&'aPP ii'!E18&\" and has no property of income of \"&Code!H97&\" own and that,\"&Code!H82&\"  is wholly dependent on me only, \"&Code!H82&\" is also not a Employee or Pensioner.\")","v":"                I, Sri. G.Saivijaya Kumar, School Assistant (Phy. Edn.),ZPP. High School, Balayapalli,Jammikunta, Kareemnagar District ,do hereby declare that Smt.G.Padmavathamma,Self Aged  96 years and has no property of income of his own and that,he  is wholly dependent on me only."}]
[]
[]
[]
[]
[]
[]
[]
[]
[]
[]
[]
[]
[]
[null,null,"Signature of the \nGovernment Servant.",null,null,null,null,"Signature of the\nDrawing & Disbursing Officer."]

{"sheet":"Avilment","index":16,"n_rows":12,"n_cols":7,"rows_kept":12,"cut":false,"hidden":false,"merged":[[11,1,11,4],[11,6,11,9],[1,1,1,9],[1,10,1,11],[2,1,2,9],[5,1,5,9]]}
[]
[null,"AVAILMENT CERTIFICATE GIVEN BY THE GOVERNMENT SERVANT"]
[]
[]
[]
[null,{"$f":"\"                   Medical Reimbursement of \"&'Form c'!I20&\" of \" &Code!R30&\",\"&Code!R31&\",\"&Code!R32&\",\"&Code!R33&\" Mandal \"&Code!R34&\" is \"&Mandals1!AE87&\" spell of claim.\"&Code!Y12&\" was under gone treatment for \"&MAIN!$Q$9&\" at \"&Code!O1&\" \"&'Check Slip'!E9","v":"                   Medical Reimbursement of Smt.G.Padmavathamma,Self of Sri. G.Saivijaya Kumar,School Assistant (Phy. Edn.),ZPP. High School, Balayapalli,Jammikunta Mandal Kareemnagar District  is first spell of claim.she was under gone treatment for Undrewent Phacoemulsification with IOL implementation left eye and cataract left eye at Venkatapadma Hospitals, 15-1-45, Three\nLamps Junction, Beside Masjid, Vizianagaram from 17-7-2010 to 21-6-2011."}]
[]
[]
[]
[]
[]
[null,"Signature of the \nGovernment Servant.",null,null,null,null,"Signature of the\nDrawing & Disbursing Officer."]

{"sheet":"Nondrawl.","index":17,"n_rows":11,"n_cols":7,"rows_kept":11,"cut":false,"hidden":false,"merged":[[1,1,1,9],[2,1,2,9],[6,1,6,9],[10,1,10,4],[10,6,10,9],[4,1,4,9]]}
[]
[null,"NON DRAWL CERTIFICATE"]
[null,"(As per instructions issued in C & DSE, A.P., Hyderabad Procs. Rc.No. 8878/D3-4/2009, dated: 02-09-2009)"]
[]
[null,{"$f":"\"                 This is to certify that the amount claimed towards Medical Reimbursement for the treatment of \"&MAIN!Q9&\" at \"&Code!O1&\" \"&'Check Slip'!E9&\" in respect of  \"&Code!F65&MAIN!$R$6&\", \"&Code!B55&\" of \"&Code!R30&\",\"&Code!R31&\",\"&Code!R32&\", \"&Code!R33&\" Mandal \"&Code!R34&\" for \"&'Form c'!I33&\" is the first time and not claimed previously.\"","v":"                 This is to certify that the amount claimed towards Medical Reimbursement for the treatment of Undrewent Phacoemulsification with IOL implementation left eye and cataract left eye at Venkatapadma Hospitals, 15-1-45, Three\nLamps Junction, Beside Masjid, Vizianagaram from 17-7-2010 to 21-6-2011. in respect of  Smt.G.padmavathamma, self of Sri. G.Saivijaya Kumar,School Assistant (Phy. Edn.),ZPP. High School, Balayapalli, Jammikunta Mandal Kareemnagar District  for Rs.2000-00 (Rupees   Two Thousand   and  Zero Only)  is the first time and not claimed previously."}]
[]
[null,"              A note to that effect has also been made in the records of the school."]
[]
[]
[]
[null,"Signature of the \nGovernment Servant.",null,null,null,null,"Signature of the \nDrawing & Disbursing Officer."]

{"sheet":"Undertaking Cer","index":18,"n_rows":17,"n_cols":16,"rows_kept":17,"cut":false,"hidden":false,"merged":[[5,15,10,21],[4,2,4,12],[7,6,7,12],[11,2,11,11],[1,1,1,13],[10,2,10,13]]}
[]
[null,"UNDER TAKING FOR MEDICAL REIMBURSEMENT BY THE FORWARDING AUTHORITIES"]
[]
[]
[null,null,{"$f":"\"                                      I  do here by certify that the Medical Reimbursement proposals submitted to \"&'DDO Letter'!N4&\", \"&'DDO Letter'!N5&P17&\" \"&\"\"&MAIN!Q9&\"for \"&Code!B55&\", treatment taken at \"&Code!O1&\" \"&'Check Slip'!E9&\" for Rs.\"&MAIN!Q10&\"/-. \"&\"The above particulars are truly to the best of my knowledge and verified with reference to the records.\"&\" If any information found incorrect during the course of\"&\" audit or if any false claim found.\"&\"I will bear the responsibility and abide\"&\" by the action taken by the department  \"","v":"                                      I  do here by certify that the Medical Reimbursement proposals submitted to The District Educational Officer, Kaddapah Districtin respect of Sri. G.Saivijaya Kumar,School Assistant (Phy. Edn.),ZPP. High School, Balayapalli,Jammikunta,Kareemnagar District  towards the treatment of  Undrewent Phacoemulsification with IOL implementation left eye and cataract left eyefor self, treatment taken at Venkatapadma Hospitals, 15-1-45, Three\nLamps Junction, Beside Masjid, Vizianagaram from 17-7-2010 to 21-6-2011. for Rs.2000/-. The above particulars are truly to the best of my knowledge and verified with reference to the records. If any information found incorrect during the course of audit or if any false claim found.I will bear the responsibility and abide by the action taken by the department  "}]
[]
[null,null," "]
[null,null,null,null,null,null,"SIGNATURE OF THE FORWARDING AUTHORITY/DDO."]
[]
[]
[null,null,"Note: for Headmaster’s of Gr-II the under taking should be countersigned by the Dy.E.O. Concerned In case of M.E.O.’s the MPDO, should countersign"]
[null,null,null,null,null,null,null,null,null,null,null,null,null,null,null,{"$f":"CONCATENATE(\" \",Code!AL26)","v":" as I have undergone Treatment for the desease"}]
[]
[]
[null,null,null,null,null,null,null,null,null,null,null,null,null,null,null,{"$f":"\"in respect of\"&\" \"&Code!R30&\",\"&Code!R31&\",\"&Code!R32&\",\"&Code!R33&\",\"&Code!R34&\" \"&\"towards the treatment of \"","v":"in respect of Sri. G.Saivijaya Kumar,School Assistant (Phy. Edn.),ZPP. High School, Balayapalli,Jammikunta,Kareemnagar District  towards the treatment of "}]
[]
[null,null,null,null,null,null,null,null,null,null,null,null,null,null,null,{"$f":"IF(Code!B55=\"self\",'Undertaking Cer'!P15,'Undertaking Cer'!P12)","v":"in respect of Sri. G.Saivijaya Kumar,School Assistant (Phy. Edn.),ZPP. High School, Balayapalli,Jammikunta,Kareemnagar District  towards the treatment of "}]

{"sheet":"Medical Attendence Rules","index":19,"n_rows":961,"n_cols":3,"rows_kept":961,"cut":false,"hidden":false,"merged":[[5,1,960,1]]}
[]
[null,"The AP Government Employee's Loans Medical Attendance & Family Welfare Code"]
[null,"The Andhra Pradesh Integrated Medical Attendance Rules, 1972"]
[]
[]
[null,null,"PART 7"]
[]
[null,null,"                    MEDICAL ATTENDANCE RULES"]
[]
[null,null,"        The Andhra Pradesh Integrated Medical Attendance"]
[null,null,"                        Rules, 1972"]
[]
[null,null,"1.       Short  title :--These rules may be  called  the  \"Andhra"]
[null,null,"Pradesh Medical Attendance Rules,1972."]
[]
[null,null,"2.       Extent  of Application :-(a) They shall  extend  to  the"]
[null,null,"whole of the State of Andhra Pradesh."]
[]
[null,null,"(2) These rules also apply to persons who are entitled to medical"]
[null,null,"attendance  under  the  Secretary  of  State  Services   (Medical"]
[null,null,"Attendance)   Rules,  1938,  the  All  India  Services   (Medical"]
[null,null,"Attendance)  Rules,  1954 and also to the  Andhra  Pradesh  State"]
[null,null,"Higher  Judicial Officers who are to be treated on par  with  the"]
[null,null,"I.A.S. and I.P.S. Officers, but only to the extent to which  they"]
[null,null,"are not inconsistent with these rules. ."]
[]
[null,null,"3.       Definitions :- In these rules unless there  is  anything"]
[null,null,"repugnant in the subject or context -"]
[]
[null,null,"(1)    \"Government Servant\" means a whole time Government Servant"]
[null,null,"employed under the Government of Andhra Pradesh and includes such"]
[null,null,"servants  employed under State Governments with  whom  reciprocal"]
[null,null,"agreements  in  respect of medical attendance have  been  entered"]
[null,null,"into, but does not include part time or honorary workers ;"]
[]
[null,null,"(2)     \"Hospital\" means a Government Hospital and  includes  any"]
[null,null,"Special  Hospital in the State or any other  Medical  Institution"]
[null,null,"recognised by the Government."]
[]
[null,null,"Note  :-Non-gazetted Officers and Employees of the  local  bodies"]
[null,null,"drawing salaries not exceeding Rs. 300 per mensem in the  greater"]
[null,null,"Hyderabad city are permitted to take treatment for their families"]
[null,null,"in the Maternity and Child Welfare Centres of the Corporation  of"]
[null,null,"Hyderabad  only  in  emergencies and  get  reimbursement  of  the"]
[null,null,"expenses incurred by them, the emergency being certified as  such"]
[null,null,"by the Medical Officer in charge of the Centre;"]
[]
[null,null,"(3)      \"Registered   Medical  Practitioner\"  means   a   person"]
[null,null,"registered  under  the  Madras  Medical  Registration  Act,  1914"]
[null,null,"adopted   to   Andhra  State;  and  the  Andhra   Ayurvedic   and"]
[null,null,"Homoeopathic  Medical Practitioners' Registration Act,  1956  and"]
[null,null,"the  Medical Act No. 1 of 1312 Fasli of the  erstwhile  Hyderabad"]
[null,null,"Government;"]
[]
[null,null,"(4)     \"Authorised  Medical Attendant\" means a  Medical  Officer"]
[null,null,"attached  to the Government Hospital or Dispensary in  the  State"]
[null,null,"who  has been nominated by the Government, from time to time,  to"]
[null,null,"Serve as Authorised Medical Attendant for the State Government"]
[null,null,"Servants ;"]
[]
[null,null,"[A  list  of  Authorised Medical  Attendants,  appointed  by  the"]
[null,null,"Government is given in Appendix I to these Rules.]"]
[]
[null,null,"(5)    \"Patient\" means a Government Servant or any member of  his"]
[null,null,"family and to whom these rules apply and who has fallen ill ;"]
[]
[null,null,"(6)    \"Station\" means the town or place in which the  Government"]
[null,null,"Servant and other entitled person falls ill ;"]
[]
[null,null,"(7)     \"Family\" :-(a) In the case of a male Government  Servant,"]
[null,null,"family means his parents, wife, legitimate children including  an"]
[null,null,"adopted son and step Children residing with and wholly  dependent"]
[null,null,"on him ;"]
[]
[null,null,"(b)  In  the  case of a woman Government  Servant  it  means  her"]
[null,null,"parents, husband and children residing with and wholly  dependent"]
[null,null,"on her."]
[]
[null,null,"(i)     The word 'wife' includes more than one wife."]
[]
[null,null,"(ii)     The claims for reimbursement of expenses in  respect  of"]
[null,null,"parents  should  be accompanied by declaration  in  the  proforma"]
[null,null,"given below."]
[]
[null,null,"                            Proforma"]
[]
[null,null,"I, .................................................. (full  name"]
[null,null,"and      designation)      hereby      declare      that       my"]
[null,null,"father/mother.....................has  no property or  income  of"]
[null,null,"his/her own and that he/she is wholly dependent on me."]
[]
[]
[null,null,"                                            Signature and date."]
[]
[null,null,"(iii)  A  married  daughter who is under the  protection  of  her"]
[null,null,"husband  does  not  come within the definition  of  \"family\"  for"]
[null,null,"purposes of these rules."]
[]
[null,null,"(iv)  The  deserted,  divorced,  or  widowed  daughters  who  are"]
[null,null,"residing  with entirely dependent on the Government Servants  and"]
[null,null,"Employees of local bodies drawing salaries not exceeding Rs.  300"]
[null,null,"per  month  are  eligible  for  medical  concessions  allowed  to"]
[null,null,"Government Servants under these rules."]
[]
[null,null,"(v) Their family for purpose of these rules will include adoptive"]
[null,null,"parents  who are wholly dependent on the Government Servants  but"]
[null,null,"does  not  include  the  real parents,  though  they  are  wholly"]
[null,null,"dependant  on  the  Government  Servants  once  the  adoption  is"]
[null,null,"effected].  [G.O.Ms.No.  123, Health, Dt. 25-11-76  &  G.O.Ms.No."]
[null,null,"718, Health, Dt. 18-7-1975]"]
[]
[null,null,"(vi)  Medical  reimbursement  bills of the Member  of  the  State"]
[null,null,"Legislature can be presented directly to the District Treasury or"]
[null,null,"Sub-treasury  as the case may be, from which they are  authorised"]
[null,null,"to draw their salaries; on the basis of essentiality  certificate"]
[null,null,"issued by the Authorised Medical Attendant without insisting  for"]
[null,null,"the countersignature of the District Medical and Health  Officer,"]
[null,null,"or Superintendent as the case may be.]"]
[]
[null,null,"[Inserted by G.O.Ms.No.418, H&M, Dt. 26-6-1979]"]
[]
[null,null,"(8)      \"Well-to-do-person\" means a person who is in receipt  of"]
[null,null,"an annual income of Rs.  1,200 or more or who is a member of  the"]
[null,null,"family of such a person and actually dependent on him."]
[]
[null,null,"4.      Medical Attendance :-(1) Medical Attendance in respect of"]
[null,null,"a  Government  Servant whose pay is not less  than Rs.  500  p.m."]
[null,null,"means :-"]
[]
[null,null,"(i)  Attendance  in a hospital or at the consulting room  of  the"]
[null,null,"Authorised  Medical  Attendant or at the residence of  the  Govt."]
[null,null,"Servant;"]
[]
[null,null,"(ii)  All pathological, bacteriological, radiological  and  other"]
[null,null,"methods  of  examination  for the purpose of  diagnosis,  as  are"]
[null,null,"available  in  any Government Hospital within the State  and  are"]
[null,null,"considered necessary by the Authorised Medical Attendant ;"]
[]
[null,null,"(iii)  Any  consultation with a Specialist in  Government  employ"]
[null,null,"within the State or other Medical Officer similarly in Government"]
[null,null,"employ within the State or that the Authorised Medical  Attendant"]
[null,null,"may certify to be necessary to such extent and in such manner  as"]
[null,null,"the  Specialist  or  Medical Officer  in  consultation  with  the"]
[null,null,"Authorised Medical Attendant, determine."]
[]
[null,null,"(2)      Medical  Attendance in respect of any  other  Government"]
[null,null,"Servant, means-"]
[]
[null,null,"(i) Attendance at a Government Hospital or at the consulting room"]
[null,null,"of  the Authorised Medical Attendant or in case of illness  which"]
[null,null,"compels  the  patient  to be confined to his  residence,  at  the"]
[null,null,"residence of the Government Servant;"]
[]
[null,null,"(ii)  All methods of examination for purposes of  diagnosis  that"]
[null,null,"are available in the nearest Government Hospital."]
[]
[null,null,"(iii) Any consultation with a Specialist or other Medical Officer"]
[null,null,"stationed in the State that the Authorised Medical Attendant  may"]
[null,null,"certify to be necessary, to such extent and in such manner as the"]
[null,null,"Special Officer may, in consultation with the Authorised  Medical"]
[null,null,"Attendant, determine ;"]
[]
[null,null,"(3)      There  will  be cases of not  infrequent  occurrence  in"]
[null,null,"which,  it  will be proper for the medical officer to  visit  the"]
[null,null,"Government  Servant  in  receipt of  salaries  under  Rupees  one"]
[null,null,"hundred  at  their residences. The Government trust to  the  good"]
[null,null,"sense and good feeling of the medical profession in preference to"]
[null,null,"laying down any precise rules for such cases."]
[]
[null,null,"(4)     It should be distinctly understood that a medical officer"]
[null,null,"will  not  be  expected to attend a  Government  Servant  at  his"]
[null,null,"residence  unless the patient is unable to wait upon the  medical"]
[null,null,"officer  either at the latter's residence or his consulting  room"]
[null,null,"or till such time as may be appointed by the Medical Officer  for"]
[null,null,"the purpose ;"]
[]
[null,null,"(5)     Medical Officers who are Authorised Medical Attendants to"]
[null,null,"the  Government Servants, should not charge any  consultation  or"]
[null,null,"other   fees  from  the  Government  Servants  for  the   Medical"]
[null,null,"Attendance rendered to them."]
[]
[null,null,"5. Medical Treatment :-Medical Treatment means use of all medical"]
[null,null,"and  surgical facilities available at the Government Hospital  in"]
[null,null,"which the patient is treated and includes :-"]
[]
[null,null,"(1)       Employment  of  such   pathological,   bacteriological,"]
[null,null,"radiological  or  other methods of investigation,  etc.,  as  are"]
[null,null,"considered necessary by the Authorised Medical Attendant ;"]
[]
[null,null,"(2)      Supply of such medicines, special or ordinary  vaccines,"]
[null,null,"sera or other therapeutic substances as are ordinarily  available"]
[null,null,"in Government Hospitals in the State ;"]
[]
[null,null,"[Note  :-Wherever  a Government Servant  consults  an  Authorised"]
[null,null,"Medical Attendant/ Specialist in the latter's consulting Room and"]
[null,null,"medicines were prescribed, the Medical Officer of the Secretariat"]
[null,null,"Dispensary  is  authorised to issue medicines to  the  Government"]
[null,null,"servant  and  their families of the prescriptions  given  by  the"]
[null,null,"Authorised  Medical Attendant, Specialist although they  are  not"]
[null,null,"attached  to  the Secretariat Dispensary. In case  the  medicines"]
[null,null,"prescribed by the Authorised Medical Attendant/Specialist are not"]
[null,null,"available  even  at the Secretariat  Dispensary,  the  Government"]
[null,null,"Servants  may purchase the medicines outside and get  the  amount"]
[null,null,"spent thereby reimbursed later as per rules. The Medial  Officer,"]
[null,null,"Secretariat  Dispensary, is not ordinarily bound to purchase  and"]
[null,null,"supply  the medicines. He will, however, stock all the  necessary"]
[null,null,"medicines in the dispensary to meet the requirements.] [Added  by"]
[null,null,"G.O.Ms.No. 1274, M.&H. (Kl), Dt. 29-12-1978]"]
[]
[null,null,"(3)      Supply  of  such  medicines,  vaccines,  sera  or  other"]
[null,null,"therapeutic  substances  as  are  not  ordinarily  available   in"]
[null,null,"Government  Hospitals  as the Authorised  Medical  Attendant  may"]
[null,null,"certify  in writing to be essential for the recovery or  for  the"]
[null,null,"prevention of deterioration in the condition of the patient."]
[]
[null,null,"(i)  The  refund  of  the cost  of  preparations  which  are  not"]
[null,null,"medicines but are primarily foods, tonics, toilet preparations or"]
[null,null,"disinfectants is not admissible under the rules. Prescription  of"]
[null,null,"expensive   drugs,  tonics,  laxatives  or  other   elegant   and"]
[null,null,"proprietary  preparations  for  the use  of  Govt.  Servants  and"]
[null,null,"members  of their families when drugs of equal therapeutic  value"]
[null,null,"are available in hospital and dispensaries is prohibited. List of"]
[null,null,"items  for  which  refund is not  admissible  under  the  Medical"]
[null,null,"Attendance Rules are given in Appendix II."]
[]
[null,null,"(ii)  Sales  Tax  paid by Government  Servants  while  purchasing"]
[null,null,"special medicines from the market is refundable under the  Rules."]
[null,null,"Packing  and  postage  charges paid by  Government  Servants  for"]
[null,null,"purchasing   special   medicines  from   out-stations   are   not"]
[null,null,"refundable."]
[]
[null,null,"(iii)  All claims for refund of expenses incurred on  account  of"]
[null,null,"the purchase of the special medicines should be preferred in  the"]
[null,null,"manner indicated in Appendix III."]
[]
[null,null,"[Note :-Bills for small amounts upto Rs. 157- at a time need  not"]
[null,null,"be  countersigned  by the Authorised Medical Attendant.  In  such"]
[null,null,"cases,  Essentiality Certificate should specifically mention  the"]
[null,null,"names  and quantum of medicines required. Also, that  certificate"]
[null,null,"should be marked as cancelled while the bill is submitted so that"]
[null,null,"it cannot be used again.]"]
[]
[null,null,"[Added by G.O.Ms.No. 1274, M.&H. (Kl), Dt. 29-12-1978]"]
[]
[null,null,"(4)    Treatment of confinement cases of a Government Servant and"]
[null,null,"includes prenatal and post-natal treatment."]
[]
[null,null,"Note :- The pre-natal and post-natal treatment can be had at  the"]
[null,null,"Government Medical Institutions in the State where facilities are"]
[null,null,"available  and  where no such facilities are available  the  case"]
[null,null,"should be referred to the concerned nearest Government specialist"]
[null,null,"by  the Authorised Medical Attendant. These treatments should  be"]
[null,null,"treated as \"other treatment\" for which a woman Government Servant"]
[null,null,"or  the  wife or other members of a male Government  Servant  are"]
[null,null,"entitled.                (G.O.Ms.No. 1466, Health, Dt. 31-8-1965)"]
[]
[null,null,"(5)      Such  accommodation  as is ordinarily  provided  in  the"]
[null,null,"Hospital and is suited to the status of a Government Servant with"]
[null,null,"reference to his pay as indicated below :-"]
[]
[null,null,"(i) Government Servants drawing          \"A\"class ward.In case"]
[null,null,"    Rs. 500 and above p.m.                accommodation in\"A\""]
[null,null,"                                          class ward is not"]
[null,null,"                                          available\"A-2\"class"]
[null,null,"                                          ward.(single rooms"]
[null,null,"                                          with/without attached"]
[null,null,"                                          Bath-room)."]
[]
[null,null,"(ii) Other Government Servants            \"B\"class ward(cement"]
[null,null,"     drawing Rs. 250-499 p.m.              or wooden partitioned"]
[null,null,"                                           cubicles)."]
[]
[]
[null,null,"(iii) Government Servants Rs.            \"C\"class ward(curtained"]
[null,null,"      100-244 p.m.                          drawing cubicles)."]
[]
[null,null,"(iv)  Government Servants                   General ward."]
[null,null,"      drawing below Rs. 100 p.m."]
[]
[null,null,"                         (G.O.Ms.No. 1382, Health, Dt. 9-4-1964)"]
[]
[null,null,"(6)     Such nursing as is ordinarily available provided  in  the"]
[null,null,"hospital  and is suited to his status and includes  such  special"]
[null,null,"nursing  as  the  Authorised Medical  Attendant  may  certify  in"]
[null,null,"writing to be essential for the recovery or for the prevention of"]
[null,null,"serious deterioration in the condition of the Government Servant."]
[]
[null,null,"If  at  all a Government Servant requires extra  nursing  he  may"]
[null,null,"engage an attendant at his own cost."]
[]
[null,null,"(7)     Such diet as is ordinarily provided to other patients  in"]
[null,null,"the hospital."]
[]
[null,null,"Note  :-This  concession is applicable only to  the  Non-Gazetted"]
[null,null,"Officers and Employees of local bodies drawing pay not  exceeding"]
[null,null,"Rs. 300 and members of their families."]
[]
[null,null,"(8)    Blood transfusion service."]
[]
[null,null,"(9)    Provision of ambulance service wherever necessary for  the"]
[null,null,"transport of the patient to the Hospital."]
[]
[null,null,"Note  (1)  :-Charges  paid  to  hospital,  ambulance  or  to  the"]
[null,null,"ambulance  of  a  social service organisation  (if  there  is  no"]
[null,null,"ambulance   attached  to  the  local  Government  Hospital)   are"]
[null,null,"reimbursed  on  production  of a  certificate  from  the  medical"]
[null,null,"attendant   that   the   use   of   ambulance   was    necessary."]
[null,null,"(G.O.Ms.No. 1466, Health, Dt. 31-8-1956)"]
[]
[null,null,"Note   (2)  :-[The  cost  of  artificial  limbs,  hearing   aids,"]
[null,null,"corrective glasses, artificial teeth and invalid chairs,  charges"]
[null,null,"are reimbursable to the eligible patients who are entitled to the"]
[null,null,"facilities for sanction of medical reimbursement]."]
[]
[null,null,"(Subs,  by G.O.Ms.No. 175, H.M. & F.W., Dt. 7-3-1990 w.e.f.  1-3-"]
[null,null,"1990)"]
[]
[null,null,"Note  (3)  :-Under  Rule  5  (9) cost  of  pace  marked  and  its"]
[null,null,"replacement charges are reimbursable."]
[null,null,"(G.O.Ms.No. 502, Health, Dt. 8-8-1978)"]
[]
[null,null,"6. Persons entitled to free medical treatment :-(i) The following"]
[null,null,"persons are entitled to free medical attendance :-"]
[]
[null,null,"(a)      All Government Servants under the rule making powers  of"]
[null,null,"the  Government  of  Andhra Pradesh  subject  to  the  conditions"]
[null,null,"specified  in  these rules, Government Servants are  entitled  to"]
[null,null,"free medical attendance irrespective of whether they are on  duty"]
[null,null,"or on leave, anywhere in the State."]
[]
[null,null,"(b)      Employees   of  the  Local  Bodies   (Zilla   Parishads,"]
[null,null,"Municipalities,   Panchayat  Samithis  and  Panchayats)   drawing"]
[null,null,"salaries not exceeding Rs. 3007- p.m."]
[]
[null,null,"The  Employees  of  Zilla Grandhalaya Samsthas  drawing  pay  not"]
[null,null,"exceeding  Rs.  3007  -  p.m.  are  eligible  for  free   medical"]
[null,null,"attendance in the Government Hospitals in the State."]
[]
[null,null,"                        (G.O.Ms.No. 915, Health, Dt. 8-7-1975)"]
[]
[null,null,"Note (1):-Families of Government Servants and Employees of  Local"]
[null,null,"Bodies  drawing pay not exceeding Rs. 3007- p.m. are eligible  to"]
[null,null,"free  medical  attendance  and  the  rules  shall  apply  mutatis"]
[null,null,"mutandis to them as they apply to the Government Servant himself."]
[]
[null,null,"(2)     All the N.G.Os. and members of Local Bodies  drawing  pay"]
[null,null,"not  exceeding Rs. 300/- p.m. and members of their families  when"]
[null,null,"admitted  to State Government Medical Institutions  are  exempted"]
[null,null,"from  payment of diet charges and the entire cost of special  and"]
[null,null,"expensive drugs administered to them."]
[]
[null,null,"(3)     Employees of Local Bodies who are drawing more  than  Rs."]
[null,null,"300  p.m.  as they will be treated as members of the  public  and"]
[null,null,"charges collected from them as per rules."]
[]
[null,null,"(4)      Law Officers viz., (Advocate-General, State  Prosecutor,"]
[null,null,"State   Counsel,  Government  Pleader  and  Public   Prosecutor),"]
[null,null,"President, Chairman and Members of Local Bodies, Reserve Bank  of"]
[null,null,"India  and Currency Officers and Retired Government Servants  are"]
[null,null,"not entitled to free medical attendance."]
[]
[null,null,"Note  :-These rules are applicable to the Local Bodies  Employees"]
[null,null,"who    are    drawing    pay    not    exceeding    Rs.    300/-."]
[null,null,"(G.O.Ms.No. 699, M.& H, Dt. 23-7-1976)"]
[]
[null,null,"(c)     Members of the State Legislature."]
[]
[null,null,"(d)    Village Officers and Servants."]
[]
[null,null,"(e)      Officers  of  the Hind Kusht Nivaran  Sangh  working  in"]
[null,null,"Government Medical Institutions."]
[]
[null,null,"(f)      Honorary  Medical  Officers, House  Surgeons  and  House"]
[null,null,"Physicians  employed  in  Government  Hospitals  in  the   State,"]
[null,null,"Students  of  Government  Medical Colleges in  the  State,  Nurse"]
[null,null,"Pupils,  Auxiliary Nurse-Midwives and Health Visitors  undergoing"]
[null,null,"training and Gramsevak Trainees."]
[]
[null,null,"Note  :-Students  in Medical Colleges include also  the  students"]
[null,null,"undergoing courses in such colleges, such as Sanitary Inspectors,"]
[null,null,"Auxiliary Health Workers, etc."]
[]
[null,null,"(g)     Persons appointed under emergency provisions in the posts"]
[null,null,"carrying  a  fixed  or time scale of pay, only so  long  as  they"]
[null,null,"continue  in  service during the period of their treatment  in  a"]
[null,null,"Government Medical Institution."]
[]
[null,null,"(h)     Retired  and re-employed pensioners  (Gazetted  and  Non-"]
[null,null,"Gazetted), (i)     Government Servants under suspension."]
[]
[null,null,"(j)  Menials  in  the service of both the  Government  and  Local"]
[null,null,"Bodies who are paid from contingencies on monthly basis."]
[]
[null,null,"(k)    The work-charged establishment of all departments. Note \\-"]
[null,null,"Casual  and daily paid workers are not eligible for free  medical"]
[null,null,"aid."]
[]
[null,null,"(1)  The  staff  employed  in the Office  of  the  State  Welfare"]
[null,null,"Advisory  Board, Hyderabad and the Welfare Extension Projects  in"]
[null,null,"the districts drawing a pay not exceeding Rs. 300 p.m. and  their"]
[null,null,"families will be given the same privileges in respect of  medical"]
[null,null,"attendance,  treatment  and  accommodation  including  the   diet"]
[null,null,"charges and administration of special and expensive drugs as  are"]
[null,null,"allowed  to  the  employees  of  local  bodies  drawing  pay  not"]
[null,null,"exceeding Rs. 300 p.m."]
[]
[null,null,"(m)  The  disabled personnel from the Defence  Services  will  be"]
[null,null,"given free treatment including diet and specialised treatment  in"]
[null,null,"the  general wards of Government Hospitals irrespective of  their"]
[null,null,"income."]
[]
[null,null,"(n) Sportsmen representing the State of Andhra Pradesh in  Inter-"]
[null,null,"State  tournaments at Government expenses, shall be  entitled  to"]
[null,null,"the  privileges  under Rule 10 of the Chapter on par  with  State"]
[null,null,"Government Servants."]
[]
[null,null,"Note  :-If  any such personnel are admitted in A, B and  C  class"]
[null,null,"warqs  or  in other special wards, the usual  charges  should  be"]
[null,null,"levied, but the Government will be prepared to consider the grant"]
[null,null,"of  concessions in individual cases on the recommendation of  the"]
[null,null,"Director of Medical and Health Services."]
[]
[null,null,"(a)     Telangana System of giving free treatment to the patients"]
[null,null,"in  General wards is extended to all Government Hospitals in  the"]
[null,null,"State."]
[]
[null,null,"                        (G.O.Ms.No. 80, Health, Dt. 24-1-1976)"]
[]
[null,null,"(b)     All Freedom Fighters who are drawing pension either  from"]
[null,null,"State      Government/Central     Government/Union      Territory"]
[null,null,"Administration  in respect of their income and  their  dependants"]
[null,null,"are  eligible  for free medical treatment  and  accommodation  in"]
[null,null,"Government Hospitals on par with members of the Legislature."]
[]
[null,null,"                        (G.O.Ms.No. 652, M.&H., Dt. 8-7-1976)"]
[]
[null,null,"(ii)    Rulers of the Merged States and their families and  their"]
[null,null,"personal staff:-"]
[]
[null,null,"(a)  The rulers of the Merged States and their families  will  be"]
[null,null,"treated  on  par  with  the members of  the  Secretary  of  State"]
[null,null,"Services for urposes of free medical attendance and treatment and"]
[null,null,"the  provisions of the Secretary of State Services (M.A.)  Rules,"]
[null,null,"1938   except   those  relating  to  travelling   allowance   and"]
[null,null,"reimbursement  of  any cost incurred in respect  of  the  medical"]
[null,null,"advice obtained by them will apply to them."]
[]
[null,null,"(b)  The  personal staff of the Rulers of the Merged  States  and"]
[null,null,"their  families will be given the same privileges in  respect  of"]
[null,null,"medical attendance, treatment and accommodation as are allowed to"]
[null,null,"Government   Servants  under  the  rule-making  powers   of   the"]
[null,null,"Government."]
[]
[null,null,"7. Arrangements tor Free Medical Attendance :-(1) All  Government"]
[null,null,"Servants  and  other  entitled personnel are  eligible  for  free"]
[null,null,"medical  attendance in the Government Hospitals in the State  and"]
[null,null,"to the extent specified in Rule 4 above."]
[]
[null,null,"(2) Persons entitled to treatment free of charge in any hospital,"]
[null,null,"shall  produce before the hospital authorities an  identification"]
[null,null,"certificate  signed  by the Department or by a  Gazetted  Officer"]
[null,null,"dealing  with establishment matters or by the Head of the  Office"]
[null,null,"in which they are working in the following form :-"]
[]
[null,null,"                  GOVERNMENT OF ANDHRA PRADESH"]
[]
[null,null,"                   Identification Certificate"]
[]
[null,null,"Name of the Officer/Official..........................."]
[]
[null,null,"Designation............................................"]
[]
[null,null,"Accommodation to which the"]
[null,null,"Officer/Official is entitled"]
[null,null,"in Government Hospital................................"]
[]
[null,null,"Station -:"]
[]
[null,null,"Date :"]
[]
[null,null,"                               Signature and Designation the Head"]
[null,null,"                                       of the Department/Office"]
[]
[null,null,"In  emergency  cases the above certificate will not  be  insisted"]
[null,null,"upon  at the time of admission, but the same should  be  produced"]
[null,null,"within a period of one week."]
[]
[null,null,"(3)      In any station where there may be an  Assistant  Surgeon"]
[null,null,"and  where  there may not be proper hospital  accommodation,  the"]
[null,null,"duty of such officer should be to attend at their own  residence."]
[null,null,"The  Upper  subordinate grades of Government  Servants  including"]
[null,null,"clerks  whose  appointments are not gazetted  the  latter  paying"]
[null,null,"conveyance  hire should they reside more than two miles from  the"]
[null,null,"official  residence of the medical attendant. If the distance  is"]
[null,null,"such  as to entitle the medical officer to travelling  allowance,"]
[null,null,"the  amount  is payable by the Government. Should  the  case   be"]
[null,null,"reported as serious the Civil Surgeon will visit the patient."]
[]
[null,null,"(4)     The Medical Officer employed in the following classes  of"]
[null,null,"Institutions should render free medical attendance to  Government"]
[null,null,"Servants  at the stations where there are no  Government  Medical"]
[null,null,"Institutions-"]
[]
[null,null,"(i) Local Fund and Municipal Institutions for which a  percentage"]
[null,null,"contribution  is  given  towards  the  pay  of  medical  officers"]
[null,null,"employed therein."]
[]
[null,null,"(ii) Local Fund and Municipal Medical Institutions in respect  of"]
[null,null,"which  the  Government meet one half of  the  annual  maintenance"]
[null,null,"charges."]
[]
[null,null,"(iii)  Local  Fund  and  Municipal  Taluk  Headquarters   Medical"]
[null,null,"Institutions  in respect of which the Government meet the  entire"]
[null,null,"or  a  portion  of the salaries of  Government  Medical  Officers"]
[null,null,"employed in them."]
[]
[null,null,"(iv) In places where there are no Government Hospitals, but where"]
[null,null,"there  are local fund or private hospitals, or dispensaries,  the"]
[null,null,"Non-Gazetted  Officers and Employees of the Local Bodies  drawing"]
[null,null,"less  than  Rs.  300/- per mensem and  their  families  may  take"]
[null,null,"treatment  stratightaway  in  such  institutions  and  that   the"]
[null,null,"expenditure as incurred by them in that connection including  the"]
[null,null,"cost  of  special and expensive drugs purchased by  them  on  the"]
[null,null,"prescription  of  the  doctor in charge of  the  institution,  be"]
[null,null,"reimbursed  subject  to the production of relevant  vouchers  and"]
[null,null,"subject  to the scrutiny of the relative bills by the  authorised"]
[null,null,"medical attendant."]
[]
[null,null,"At places where there are no Government or Non-Government Medical"]
[null,null,"Institutions, Non-Gazetted Oilicers and Employees of Local Bodies"]
[null,null,"drawing  less  than Rs. 3007- per mensem and their  families  may"]
[null,null,"avail  themselves  of  the services of local  private  doctor  in"]
[null,null,"emergencies  where there is no sufficient time for them to go  to"]
[null,null,"the  nearest  Government  Medical  Institution.  The  expenditure"]
[null,null,"incurred  by them in that connection will be reimbursed  to  them"]
[null,null,"subject to the production of relevant vouchers and subject to the"]
[null,null,"relative  bills by the District Medical Officer concerned and  to"]
[null,null,"his  certifying  that  the  amount  claimed  is  reasonable   and"]
[null,null,"expenditure  incurred was necessary. In non-emergent  cases,  the"]
[null,null,"entitled  personnel  serving in places where  there  are  neither"]
[null,null,"Government   Medical  Institutions  nor  Non-Government   Medical"]
[null,null,"Institutions  should go to the Government Medical Institution  or"]
[null,null,"the Non-Government Medical Institution at the nearest station for"]
[null,null,"treatment."]
[]
[null,null,"                        (G.O.Ms.No. 208, Health, Dt. 9-2-1955)"]
[]
[null,null,"(v) (a) The N.G.Os. and the Employees of Local Bodies in stations"]
[null,null,"where   there  are  no  Government  or   Non-Government   Medical"]
[null,null,"Institutions  who  seek treatment in an  emergency,  under  Local"]
[null,null,"Private   doctors   should  in  addition  to   the   essentiality"]
[null,null,"certificate from the private doctors produce a certificate in the"]
[null,null,"form   given  hereunder  from  the  nearest  authorised   medical"]
[null,null,"attendant immediately after they are in a fit condition to travel"]
[null,null,"to  the  nearest  authorised medical  attendant  who  will  judge"]
[null,null,"whether  the essentially certificate issued by the local  private"]
[null,null,"doctor in such cases is a genuine one or not."]
[]
[null,null,"\"I certify that there are no Government or Non-Government Medical"]
[null,null,"Institutions            available             in             the"]
[null,null,"village..........................of.......................Taluk\"."]
[]
[null,null,"\"I     also    certify    that    I    examined    the    patient"]
[null,null,"(Name)........................."]
[null,null,"(Designation)........................(Department).................."]
[null,null,"and  consider  that  the case in question  is  an  emergency  one"]
[null,null,"requiring immediate treatment under a local private doctor.\""]
[]
[]
[null,null,"                                       Signature of authorised"]
[null,null,"                                            Medical Attendant."]
[]
[null,null,"(b)     The local private Registered Medical Practitioner  should"]
[null,null,"prescribe the drugs contained in the lists in Appendix IV as  far"]
[null,null,"as possible."]
[]
[null,null,"                        (G.O.Ms.No. 1585; Health, Dt. 21-9-1956)"]
[]
[null,null,"8.       Free  of  charges  :-(1)    A  Govt.  Servant  shall  be"]
[null,null,"entitled free of charges :- (i)     to treatment-"]
[]
[null,null,"(a)      in such Government Hospital, at or near the place  where"]
[null,null,"he  falls  ill as can in the opinion of  the  authorised  medical"]
[null,null,"attendant, provide the necessary and suitable treatment, or"]
[]
[null,null,"(b)     if  there be no such hospital as is referred to  in  sub-"]
[null,null,"clause  (a), in such hospital, other than a Government  Hospital,"]
[null,null,"at  or near that place as can, in the opinion of  the  authorised"]
[null,null,"medical attendant, provide the necessary and suitable treatment,"]
[]
[null,null,"(ii)     to  anti-rabic  treatment  at  the  nearest   Government"]
[null,null,"Hospital providing such treatment."]
[]
[null,null,"(2) Where a Government Servant is entitled under sub-rule(l) free"]
[null,null,"of charge, no treatment in any hospital any amount paid by him on"]
[null,null,"account of such treatment shall on production of a certificate in"]
[null,null,"writing  by  authorised  medical  attendant  in  this  behalf  be"]
[null,null,"reimbursed to him by the Government."]
[]
[null,null,"9.(1) If the authorised medical attendant is of the opinion  that"]
[null,null,"owing  to the absence or remoteness of a suitable hospital or  to"]
[null,null,"the severity of the illness, a Government Servant cannot be given"]
[null,null,"treatment  as  provided in clause (1) of Rule 6,  the  Government"]
[null,null,"Servant may receive treatment at his residence."]
[]
[null,null,"(2)    A Government Servant receiving treatment at his  residence"]
[null,null,"under sub-rule (1), shall be entitled to receive towards the cost"]
[null,null,"of such treatment as he would have been entitled, free of charge,"]
[null,null,"to  receive under these rules; if he had not been treated at  his"]
[null,null,"residence."]
[]
[null,null,"(3)     Claims for sums admissible under sub-rule (2),  shall  be"]
[null,null,"accompanied by a Certificate in writing by the authorised medical"]
[null,null,"attendant stating-(a) his reasons for the opinion referred to  in"]
[null,null,"sub-rule  (1) ; (b) the cost of similar treatment referred to  in"]
[null,null,"sub-rule (2)."]
[]
[null,null,"10.     Treatment  outside  the State but within  India  :-(1)  A"]
[null,null,"Government Servant and other entitled personnel in or  travelling"]
[null,null,"on  duty,  or on leave, in any place in the  territory  of  India"]
[null,null,"outside  Andhra  Pradesh  receives  any  medical  attendance  for"]
[null,null,"himself  or for the members of his family, any reasonable  amount"]
[null,null,"paid by him on account of such treatment shall, on production  of"]
[null,null,"a certificate in writing of the medical attendant, be  reimbursed"]
[null,null,"to him by the Government."]
[]
[null,null,"(2)    The Government Servants of this State [and their families]"]
[null,null,"residing  outside the State on official work and falling  ill  or"]
[null,null,"otherwise  requiring  medical  attention should  consult  and  be"]
[null,null,"treated  by  the  \"Medical Attendants\" authorised  to  treat  the"]
[null,null,"officers  of equal rank of that State. For the purpose  of  these"]
[null,null,"rules,  such medical attendants shall be the  Authorised  Medical"]
[null,null,"Attendants  of  the  State.                           (G.O.Ms.No."]
[null,null,"2445, Health, Dt. 16-8-1961)"]
[]
[null,null,"               [Added by G.O.Ms.No. 1274, M&H (Kl), Dt. 29-12-78]"]
[]
[null,null,"[Note  :-The  Government  recognise the All  India  Institute  of"]
[null,null,"Medical   Sciences  and  Wellingdon  Hospital,  New  Delhi,   for"]
[null,null,"treatment  of the employees of Andhra Pradesh and the members  of"]
[null,null,"their families at New Delhi, and also those visiting New Delhi.]"]
[]
[null,null,"            [Added by G.O.Ms.No. 1274, M.&H. (Kl), Dt. 29-12-1978]"]
[]
[null,null,"(3)     For  receiving  treatment  outside the  State  but  in  a"]
[null,null,"Government  medical institution of that State (on the  advice  of"]
[null,null,"the  Authorised  Medical  Attendant)  prior  permission  of   the"]
[null,null,"Director of Medical and Health Services should be obtained."]
[]
[null,null,"                        (G.O.Ms.No. 1792, Health, Dt. 7-6-1963)"]
[]
[null,null,"(4)     For  receiving treatment outside the State  but    in  an"]
[null,null,"institution  other than a Government Hospital of that  State  (on"]
[null,null,"the advice of the Authorised Medical Attendant) prior  permission"]
[null,null,"of the Government should be obtained."]
[]
[null,null,"10.(A) Treatment for Kidney transplantation and Coronary  By-pass"]
[null,null,"Surgery   by  private  hospitals  within  the  State  :-(1)   The"]
[null,null,"Government  servants and other entitled personnel  for  treatment"]
[null,null,"under  the  Rules shall be permitted by the Director  of  Medical"]
[null,null,"Education  to  undergo Kidney transplantation  operation  in  the"]
[null,null,"Mahaveer Hospital, Hyderabad and Coronary By-pass Surgery in  the"]
[null,null,"Durgabai Deshmukh Hospital, Andhra Mahila Sabha, Hyderabad-on the"]
[null,null,"letter of advice given by the Authorised Medical Attendant in the"]
[null,null,"Osmania  General Hospital, Hyderabad or the Nizam's Institute  of"]
[null,null,"Orthopaedics and Specialities, Hyderabad, respectively where  the"]
[null,null,"above operations are done."]
[]
[null,null,"(2)     The  Authorised  Medical  Attendant  in  the   Government"]
[null,null,"Hospitals  mentioned in sub-rule (1) will issue letter of  advice"]
[null,null,"only if the said hospital cannot cope with the work load and  the"]
[null,null,"treatment  of the patients cannot wait till the operations  could"]
[null,null,"be performed in the said Government Hospital; and"]
[]
[null,null,"(3)     Those  who  obtain prior permission of  the  Director  of"]
[null,null,"Medical  Education  and  get admitted to  the  private  hospitals"]
[null,null,"mentioned in sub-rule(l) for Kidney transplantation and  Coronary"]
[null,null,"By-pass  ^Surgery  will  be eligible  for  reimbursement  of  all"]
[null,null,"admissible  expenditure including charges for  accommodation  and"]
[null,null,"also  for an advance as per the estimates given by the  concerned"]
[null,null,"hospital undertaking the operation\"."]
[]
[null,null,"              (Inserted by G.O.Ms.No. 317, M&H (Kl), Dt. 7-5-1986)"]
[]
[null,null,"11.    Consultations with Specialists or Colleagues :-(1) If  the"]
[null,null,"authorised  medical attendant is of opinion that the case of  the"]
[null,null,"patient  is  of  such serious or special nature,  as  to  require"]
[null,null,"medical attendance by some person other than himself or that  the"]
[null,null,"patient  requires anti-rabic treatment, he may with the  approval"]
[null,null,"of  the  Director of Medical Services (which  shall  be  obtained"]
[null,null,"before-hand  unless  the  delay involved entails  danger  to  the"]
[null,null,"health of the patients)-"]
[]
[null,null,"(a)      send  the  patient to the nearest  Specialist  or  other"]
[null,null,"Medical  Officer as provided in clause (c) of Rule 2 by whom,  in"]
[null,null,"his opinion medical attendance is required for the patient or  in"]
[null,null,"the case of anti-rabic treatment, to the nearest place where such"]
[null,null,"treatment is available ; or"]
[]
[null,null,"(b)     if  the  patient  is  too  ill  to  travel,  summon  such"]
[null,null,"specialist or other Medical Officer to attend upon the patient."]
[]
[null,null,"(2)     A patient sent under clause (a)    of sub-rule (1)  shall"]
[null,null,"on  production  of  a certificate in writing  by  the  authorised"]
[null,null,"medical  attendant in this behalf, be entitled to travelling"]
[null,null,"allowance  for the journeys to and from the headquarters, of  the"]
[null,null,"Specialist or other Medical Officer or the place where he is sent"]
[null,null,"for anti-rabic treatment."]
[]
[null,null,"(3)    A Specialist or other Medical Officer summoned under  sub-"]
[null,null,"rule (1), shall on production of a certificate in writing by  the"]
[null,null,"Authorised  Medical  Attendant  in this behalf,  be  entitled  to"]
[null,null,"travelling allowance for the journey to and from the place  where"]
[null,null,"the patient is and also daily allowance according to rules."]
[]
[null,null,"12.     Travelling Allowance :-(1) T.A. for  journeys  undertaken"]
[null,null,"under  Rule 10 shall be at the rates admissible to  a  Government"]
[null,null,"Servant when on tour."]
[]
[null,null,"(2)  A  member  of the family of a Government  Servant  shall  be"]
[null,null,"entitled  to  travel by a class by which the  Government  Servant"]
[null,null,"himself is entitled to travel."]
[]
[null,null,"13.     Medical  Attendance Charges :-(1)  Charges  for  services"]
[null,null,"rendered   in  connection  with  but  not  included  in   medical"]
[null,null,"attendance on, or treatment of a patient entitled to free medical"]
[null,null,"attendance or treatment under these rules, shall be determined by"]
[null,null,"the authorised medical attendant and paid by the patient."]
[]
[null,null,"(2) If any question arises as to whether any service is  included"]
[null,null,"in  Medical attendance or treatment, it shall be referred to  the"]
[null,null,"Government; the decision of the Government shall be final."]
[]
[null,null,"14.    Treatment under Indian System of Medicines :-The following"]
[null,null,"procedure  is  prescribed for getting re-imbursement of  cost  of"]
[null,null,"medicine  purchased  by  the persons  entitled  to  free  medical"]
[null,null,"attendance or treatment including   State Gazetted Officers  when"]
[null,null,"treatment is taken under the indigenous system of medicine either"]
[null,null,"in the Government Institutions or under private doctors :"]
[]
[null,null,"(1)     The  bills  relating  to the  modern  medicine,  if  any,"]
[null,null,"prescribed  by  the  Medical Officer in  private  or  local  fund"]
[null,null,"institutions  or by the private practitioner will be  scrutinised"]
[null,null,"by   the authorised medical attendant of the entitled persons  in"]
[null,null,"cases  where  the  treatment was received, in  a  local  fund  or"]
[null,null,"private  institution of indigenous medicine and by  the  District"]
[null,null,"Medical  Officer  concerned  in cases  where  the  treatment  was"]
[null,null,"received from a private practitioner of indigenous medicine."]
[]
[null,null,"(2)     The  bills relating to the indigenous  medicine  will  be"]
[null,null,"scrutinised  by the medical officer or officers concerned of  the"]
[null,null,"three respective systems of medicine (Ayurveda, Sidha and  Unani)"]
[null,null,"employed   in  the  Government  Ayurvedic  Hospital,   Charminar,"]
[null,null,"Hyderabad to be nominated by the Special Officer of the  Medicine"]
[null,null,"Department with the approval of the Government."]
[]
[null,null,"(3)  If the bills relate to both modern and  indigenous  medicine"]
[null,null,"they  will  first  be  scrutinised  by  the  authorised   medical"]
[null,null,"attendant,  or the District Medical Officer, as the case may  be,"]
[null,null,"in regard to the modern medicine, and then by Medical Officers or"]
[null,null,"Officers  of  the  Government Ayurvedic  Hospital,  Hyderabad  in"]
[null,null,"respect of the indigenous medicine."]
[]
[null,null,"(4)     The claims in respect of treatment under Indian  Medicine"]
[null,null,"system  be  sanctioned by the Special  Officer  (Indian  Medicine"]
[null,null,"Department)  after due scrutiny, wherever claims  are  admissible"]
[null,null,"under rules. (G.O.Ms.No. 105, Health, Dt. 15-1-1963)"]
[]
[null,null,"Note  :-(1) Claims for refund of expenses should be preferred  as"]
[null,null,"detailed in Appendix III."]
[]
[null,null,"(2) A list of items for which refund is not admissible under  the"]
[null,null,"rules is given in Appendix II."]
[]
[null,null,"15.  Medical Attendance for Honourable Speaker,  Deputy  Speaker,"]
[null,null,"Honourable  Chairman, Deputy Chairman, Ministers, etc.,  :-(1)  A"]
[null,null,"Minister  or  the  Speaker  of  the  Andhra  Pradesh  Legislative"]
[null,null,"Assembly  or  the  Chairman of  the  Andhra  Pradesh  Legislative"]
[null,null,"Council  and the Members of his family shall be entitled free  of"]
[null,null,"charge,  to  accommodation in hospitals maintained by  the  State"]
[null,null,"Government  and also to medical treatment and attendance  on  the"]
[null,null,"same  terms and conditions as are applicable to the  officers  of"]
[null,null,"the  Indian  Administrative  Service  under  All  India  Services"]
[null,null,"(Medical Attendance) Rules, 1954."]
[]
[null,null,"(2)    A Minister or the Speaker or the Chairman and the  members"]
[null,null,"of  his  family  shall be required  to  furnish  the  certificate"]
[null,null,"prescribed  in  clause (a) of sub-rule (3) of Rule 8 of  the  All"]
[null,null,"India Service (Medical Attendance) Rules, 1954 in respect of  his"]
[null,null,"claims for re-imbursement of the medical expenses allowable under"]
[null,null,"the said rules for treatment at his residence under circumstances"]
[null,null,"referred to in Rule 1 of the said rules."]
[]
[null,null,"Explanation  :-For the purposes of this rule 'family'  means  the"]
[null,null,"wife,  son, daughter (including a validly adopted  son,  step-son"]
[null,null,"and  step-daughter,  father, mother, brother and  sister  of  the"]
[null,null,"Minister,  or  the  Speaker or the Chairman,  residing  with  and"]
[null,null,"wholly  dependent on him and not self-supporting  relations)  but"]
[null,null,"does  not include a married daughter or sister who is  under  her"]
[null,null,"husband's protection."]
[]
[null,null,"(G.O.Ms.No. 165, Health, Dt. 3-2-1960 and G.O.Ms.No. 255, G.A.D.,"]
[null,null,"Dt. 1-3-1961)"]
[]
[null,null,"(3)    A Minister and the members of his family will be  entitled"]
[null,null,"free of charges, to accommodation in hospitals maintained by  the"]
[null,null,"State Government and also to medical treatment and attendance  on"]
[null,null,"the  same terms and conditions as are applicable to  the  highest"]
[null,null,"category  of  servants employed under the  Government  of  Andnra"]
[null,null,"Pradesh, the highest category of Government Servants who get  the"]
[null,null,"maximum  concessions and benefits in the matter of  free  medical"]
[null,null,"attendance  and treatment in Government Hospitals, provided  that"]
[null,null,"the Minister and members of this family shall be entitled to  the"]
[null,null,"supply of diet free of charge."]
[]
[null,null,"(4)    The Deputy Speaker of the Legislative Assembly, the Deputy"]
[null,null,"Chairman  of  the Legislative Council, Chief Whip,  Chairman  and"]
[null,null,"Vice-Chairman  of  the  Regional  Committee,  the   Parliamentary"]
[null,null,"Secretaries, if any, the Members of the Legislative Assembly  and"]
[null,null,"Council  who  do  not  hold any of the  offices  referred  to  in"]
[null,null,"Sections 3-A to 5-A of the Andhra Payment of Salaries and Removal"]
[null,null,"of Disqualifications Act, 1953, (Andhra Act III of 1954) and  the"]
[null,null,"members  of  the families of all those mentioned above  shall  be"]
[null,null,"entitled,   free  of  charge,  to  accommodation   in   hospitals"]
[null,null,"maintained by the State Government and also medical treatment and"]
[null,null,"attendance on the same terms and conditions as are applicable  to"]
[null,null,"the Gazetted Officers of the State Government."]
[]
[null,null,"16.     Medical Attendance for very important  personages  :-Very"]
[null,null,"important personages, if they fall sick during their visit to and"]
[null,null,"stay  in  Andhra  Pradesh should be provided  with  free  medical"]
[null,null,"assistance  which  should  cover apart from  treatment  which  is"]
[null,null,"neither  prolonged nor specialised and such as a  hospital  would"]
[null,null,"ordinarily provide."]
[]
[null,null,"                       (G.O.Ms.No. 2761, Health, Dt. 15-10-1963)"]
[]
[null,null,"17.     Medical  Attendance to Members of  State  Legislature  :-"]
[null,null,"Members  of the State Legislature and members of  their  families"]
[null,null,"are  eligible  for free medical facilities as are  given  to  all"]
[null,null,"Gazetted Officers of the State Government."]
[]
[null,null,"They will accommodated in the paying rooms on par with Grade  III"]
[null,null,"Officers (as defined in the Andhra Pradesh Travelling  Allowances"]
[null,null,"Rules,  i.e., Gazetted Officers drawing pay between Rs.  750  and"]
[null,null,"1,000)  of the State whenever they are admitted for treatment  in"]
[null,null,"the Government Hospital in the State."]
[]
[null,null,"18.    Medical Attendance for Officers of the AH India  Services,"]
[null,null,"Andhra  Pradesh State on Higher Judicial Officers :-Rule 15  will"]
[null,null,"apply  for  purposes of \"Medical Attendance\" on officers  of  the"]
[null,null,"Indian Administrative and Police Services and their families  and"]
[null,null,"officers of the Andhra Pradesh State Higher Judicial Services and"]
[null,null,"their families."]
[]
[null,null,"Note  :-The Officers of the Andhra Pradesh State Higher  Judicial"]
[null,null,"Service  will  be treated on par with the members of  the  Indian"]
[null,null,"Administrative and Police Service."]
[]
[null,null,"19.    Treatment of T.B. :-(1) Rules regulating admission of T.B."]
[null,null,"patients  in  Government T.B. Institutions and  other  Government"]
[null,null,"Medical  Institutions  where there are T.B. wards  are  given  in"]
[null,null,"Appendix V."]
[]
[null,null,"(2)     The following private Hospitals which are in  receipt  of"]
[null,null,"grants  from  the State Government are  recognised  as  treatment"]
[null,null,"centres  for  the Non-Gazetted Officers and  Employees  of  Local"]
[null,null,"Bodies drawing pay not exceeding Rs. 300 P.M. and their families."]
[]
[null,null,"(i)     The U.M.T.B. Sanatorium, Madanapalle."]
[]
[null,null,"(ii)    Visrantipuram T.B. Sanatorium, Rajahmundry."]
[]
[null,null,"(3)     An  officer  who  wishes to  enter  the  institution  for"]
[null,null,"treatment  and  claim  reimbursement  of  the  charges  from  the"]
[null,null,"Government should obtain in advance a certificate from the  local"]
[null,null,"District Medical Officer to the effect that his case is one  that"]
[null,null,"requires treatment in specialised T.B. Institution."]
[]
[null,null,"(4)    Ten beds in the U.M.T.B. Sanatorium, Madanapalle and  five"]
[null,null,"beds  in  the  Visrantipuram  T.B.  Sanatorium,  Rajahmundry  are"]
[null,null,"reserved  in  the general wards for the treatment  of  Government"]
[null,null,"Servants and members of their families."]
[]
[null,null,"                        (G.O.Ms.No. 1257, Health, Dt. 24-7-1956)"]
[]
[null,null,"Note  :-In  the  first instance the entitled person  who  has  to"]
[null,null,"undergo  treatment for T.B. should produce a certificate of  non-"]
[null,null,"availability  of beds in the nearest Government  T.B.  Sanatorium"]
[null,null,"and  that  admission against the reserved beds should  be  sought"]
[null,null,"only  through  the  District Medical  Officers  of  Chittoor  and"]
[null,null,"Rajahmundry."]
[]
[null,null,"20.     Medical  Advances to N.G.Os.:-Government  Servants  (non-"]
[null,null,"gazetted officers) are eligible for advances to meet the expenses"]
[null,null,"on medical attendance and treatment.  The grant of advance  shall"]
[null,null,"be regulated by the rules given in Appendix VI."]
[]
[null,null,"21.     Reciprocal  Arrangements  with  other  Governments  :-The"]
[null,null,"Government  of  Andhra  Pradesh  have  entered  into   reciprocal"]
[null,null,"arrangements with the Government of Madras, Mysore and Kerala for"]
[null,null,"free  medical  attendance and treatment  of  Government  Servants"]
[null,null,"while  they  are on duty or in transist at the Hospitals  of  the"]
[null,null,"respective Government, subject to the following conditions :-"]
[]
[null,null,"(1)     Government Servants of any of the States mentioned  above"]
[null,null,"will   be  given  free  accommodation  in  class  admissible   to"]
[null,null,"corresponding  category  of  the employees  of  this  Government,"]
[null,null,"surgical and Nursing services including X-ray examination, radium"]
[null,null,"treatment and such other special examinations as may be necessary"]
[null,null,"in  respect  of which facilities are available in  the  Hospital."]
[null,null,"Special  treatment  shall  also be given free of  charge  on  the"]
[null,null,"advice of the Authorised Medical Attendant."]
[]
[null,null,"(2)      The  Government Servant in question shall,  however,  be"]
[null,null,"charged  for diet (in the case of Gazetted  Government  Servants)"]
[null,null,"and  they  shall also have to purchase such drugs as may  not  be"]
[null,null,"available in the hospital stores and may claim reimbursement from"]
[null,null,"their parent Government if it is admissible under their rules."]
[]
[null,null,"(3)     These arrangements have come into force with effect  from"]
[null,null,"29-8-1963  in the case of Madras Government and  1-9-1963 in  the"]
[null,null,"case of Mysore Government."]
[]
[null,null,"(G.O.Ms.No.  2382,  Health, Dt. 31-8-1963  and  G.O.Ms.No.  2997,"]
[null,null,"Health, Dt. 5-11-1963)"]
[]
[null,null,"Note  (1)  :-The  families of Employees of Tamil  Nadu  are  also"]
[null,null,"eligible for the above facilities when they accompany  Government"]
[null,null,"Employees  who happen to pass through and stay in Andhra  Pradesh"]
[null,null,"on reciprocal basis."]
[]
[null,null,"Note (2) :-The Government Servants of Andhra Pradesh availing  of"]
[null,null,"the facilities in the Medical Institutions in Tamil Nadu are  not"]
[null,null,"eligible for T.A."]
[]
[null,null,"                        (G.O.Ms.No. 371, Health, Di;: 6-4-1976)"]
[]
[null,null,"Note  (3) :-Maharashtra State Government Employees  are  eligible"]
[null,null,"for  free  Medical Attendance in the Government Hospital  of  the"]
[null,null,"State on reciprocal basis."]
[]
[null,null,"                          (G.O.Ms.No. 971, M & H, Dt. 11-10-1976)"]
[]
[null,null,"22.  All  categories of Government Servants  and  other  entitled"]
[null,null,"persons who are eligible under current rules for reimbursement of"]
[null,null,"expenses on medical treatment within India would be eligible  for"]
[null,null,"reimbursement  of expenses incurred on medial  treatment  outside"]
[null,null,"India  for which facilities are available in this  Country  also,"]
[null,null,"subject to the maximum of Rs. 40,000 (Rupees forty thousand only)"]
[null,null,"which  includes, air passage of patient and expenditure  incurred"]
[null,null,"towards Personal Attendant also."]
[]
[null,null,"They  are  also  eligible for the  reimbursement  of  the  actual"]
[null,null,"expenditure   on  such  medial  treatment  where  there  are   no"]
[null,null,"facilities  available in the Country. Expenditure on  air-passage"]
[null,null,"of  the  person  treated  as  well  as  the  air-passage  of  the"]
[null,null,"accompanying  personal  attendant  would also  be  reimbursed  by"]
[null,null,"Government in such cases."]
[]
[null,null,"Note  :-The Authorised Medical Attendant "]